From nobody Mon Oct  5 15:01:44 2026
X-Original-To: elastic@mlmmj.nyi.freebsd.org
Received: from mx1.freebsd.org (mx1.freebsd.org [IPv6:2610:1c1:1:606c::19:1])
	by mlmmj.nyi.freebsd.org (Postfix) with ESMTP id 4hz2fK3wRTz6k0Wy
	for <elastic@mlmmj.nyi.freebsd.org>; Mon, 05 Oct 2026 15:01:45 +0000 (UTC)
	(envelope-from pkg-fallout@FreeBSD.org)
Received: from mxrelay.nyi.freebsd.org (mxrelay.nyi.freebsd.org [IPv6:2610:1c1:1:606c::19:3])
	(using TLSv1.3 with cipher TLS_AES_256_GCM_SHA384 (256/256 bits)
	 key-exchange x25519 server-signature RSA-PSS (4096 bits) server-digest SHA256
	 client-signature RSA-PSS (4096 bits) client-digest SHA256)
	(Client CN "mxrelay.nyi.freebsd.org", Issuer "YR2" (not verified))
	by mx1.freebsd.org (Postfix) with ESMTPS id 4hz2fJ1Rbcz3P84
	for <elastic@FreeBSD.org>; Mon, 05 Oct 2026 15:01:44 +0000 (UTC)
	(envelope-from pkg-fallout@FreeBSD.org)
ARC-Seal: i=1; a=rsa-sha256; d=freebsd.org; s=dkim; cv=none; t=1791212504;
	b=hrwC7nSD1ASyl57FE/ot5l+yia0anfUDjf46RSzfDFhd7lz2yHd91JCqeQSjWGJnhD2Y8r
	9uJxnKqw7hqD3aK0Dh2DBz5SmRH5qJJBQdyUKZd5BLfZjL8XcGC/mrAlQsCN9ZENxmaZiv
	jwEF2suJYF0IHPtR9lLc6S2XhMeDt7wkreh3qUS50hVTUAkXAaZ5V2FsOh0hoIuq4JrInW
	Z0hDYWrgczKYcKKVT1z4GbWUaQhX1+eYk0oIJ+lHv95d3YUd3K4zH83yr0K0EBeD1gj+wG
	G9UOlhHMGeLG4nIeFs/KCzlI32+WIPyGMD1EUvOVe/W1/U6KNQOR66hyXgz+EA==
ARC-Message-Signature: i=1; a=rsa-sha256; c=relaxed/relaxed; d=freebsd.org;
	s=dkim; t=1791212504;
	h=from:from:reply-to:subject:subject:date:date:message-id:message-id:
	 to:to:cc:cc; bh=+D34DdPi0JCnX63RNnetKjiZYc8UJnbPxokz4URNkUo=;
	b=Ldj8ituTzyGK29rgjLDnl87DwrFLg5Zob7MLjfp0POvDkVljAyHwrdAlikCWHB4cIy8arg
	/1BKM3suvzHQU0Wg/yLqbqCHwbN+8l3j0ZanQL6B8/aDlnXPcUVUwhz/mAJG7FnjyfNc3p
	m+Ge2RBuziz5gv/z+O09Z4csY1xmDN7Ky7U0ZIuFnBADHCIkWuwnhR2HTDTWHlqaDoHEZs
	CnVn9CmdOdFCKwViOVm4B0GTSxrYD8CrUPAxIxoXaFdvh47jJAMYPVjamsK/KjTCE8GkML
	78FyxiAH/oeQgyVl6gHi2RwpMHfwUyZ1ZFoHwp64XASCWSmUhSIdh034VeBSUg==
ARC-Authentication-Results: i=1;
	mx1.freebsd.org;
	none
Received: from beefy19.nyi.freebsd.org (beefy19.nyi.freebsd.org [IPv6:2610:1c1:1:6080::16:22])
	by mxrelay.nyi.freebsd.org (Postfix) with ESMTP id 4hz2fJ0NkLzPMT
	for <elastic@FreeBSD.org>; Mon, 05 Oct 2026 15:01:44 +0000 (UTC)
	(envelope-from pkg-fallout@FreeBSD.org)
Received: from root (uid 0)
	(envelope-from pkg-fallout@FreeBSD.org)
	id 3ae2
	by beefy19.nyi.freebsd.org (DragonFly Mail Agent v0.13+ on beefy19.nyi.freebsd.org);
	Mon, 05 Oct 2026 15:01:44 +0000
To: elastic@FreeBSD.org
Subject: [package - 144i386-quarterly][textproc/py-elasticsearch-curator] Failed for py312-elasticsearch-curator-5.8.4_2 in configure
Cc: pkg-fallout@FreeBSD.org
Date: Mon, 05 Oct 2026 15:01:44 +0000
Message-Id: <6ac3bbd8.3ae2.4fe5baf4@beefy19.nyi.freebsd.org>
From: <pkg-fallout@FreeBSD.org>
List-Id: Support of ElasticSearch-related ports <freebsd-elastic.freebsd.org>
List-Archive: https://lists.freebsd.org/archives/freebsd-elastic
List-Help: <mailto:freebsd-elastic+help@freebsd.org>
List-Post: <mailto:freebsd-elastic@freebsd.org>
List-Subscribe: <mailto:freebsd-elastic+subscribe@freebsd.org>
List-Unsubscribe: <mailto:freebsd-elastic+unsubscribe@freebsd.org>
Sender: owner-freebsd-elastic@FreeBSD.org
List-Id: <freebsd-elastic.FreeBSD.org>
List-Post: <mailto:freebsd-elastic@FreeBSD.org>
List-Help: <mailto:freebsd-elastic+help@FreeBSD.org>
List-Subscribe: <mailto:freebsd-elastic+subscribe@FreeBSD.org>
List-Unsubscribe: <mailto:freebsd-elastic+unsubscribe@FreeBSD.org>
List-Owner: <mailto:postmaster@FreeBSD.org>
Precedence: list

You are receiving this mail as a port that you maintain
is failing to build on the FreeBSD package build server.
Please investigate the failure and submit a PR to fix
build.

Maintainer:     elastic@FreeBSD.org
Log URL:        https://pkg-status.freebsd.org/beefy19/data/144i386-quarterly/3a7a1297a515/logs/py312-elasticsearch-curator-5.8.4_2.log
Build URL:      https://pkg-status.freebsd.org/beefy19/build.html?mastername=144i386-quarterly&build=3a7a1297a515
Log:

=>> Building textproc/py-elasticsearch-curator
build started at Mon Oct  5 15:01:40 UTC 2026
port directory: /usr/ports/textproc/py-elasticsearch-curator
package name: py312-elasticsearch-curator-5.8.4_2
building for: FreeBSD 144i386-quarterly-job-07 14.4-RELEASE-p10 FreeBSD 14.4-RELEASE-p10 i386
maintained by: elastic@FreeBSD.org
Makefile datestamp: -rw-r--r--  1 root wheel 1203 Oct  4 01:01 /usr/ports/textproc/py-elasticsearch-curator/Makefile
Ports top last git commit: 3a7a1297a515552d4aef02f06cd5ee1a92ed4583
Ports top unclean checkout: no
Port dir last git commit: 3a7a1297a515552d4aef02f06cd5ee1a92ed4583
Port dir unclean checkout: no
Poudriere version: poudriere-git-3.4.8-3-gd92fb7c0
Host OSVERSION: 1600022
Jail OSVERSION: 1404000
Job Id: 07

---Begin Environment---
SHELL=/bin/sh
BLOCKSIZE=K
MAIL=/var/mail/root
MM_CHARSET=UTF-8
LANG=C.UTF-8
OSVERSION=1404000
STATUS=1
HOME=/root
PATH=/sbin:/bin:/usr/sbin:/usr/bin:/usr/local/sbin:/usr/local/bin:/root/bin
MAKE_OBJDIR_CHECK_WRITABLE=0
UNAME_m=i386
UNAME_p=i386
UNAME_r=14.4-RELEASE-p10
LOCALBASE=/usr/local
UNAME_v=FreeBSD 14.4-RELEASE-p10
USER=root
POUDRIERE_NAME=poudriere-git
LIBEXECPREFIX=/usr/local/libexec/poudriere
POUDRIERE_VERSION=3.4.8-3-gd92fb7c0
MASTERMNT=/usr/local/poudriere/data/.m/144i386-quarterly/ref
LC_COLLATE=C
POUDRIERE_BUILD_TYPE=bulk
PACKAGE_BUILDING=yes
SAVED_TERM=
OUTPUT_REDIRECTED_STDERR=4
OUTPUT_REDIRECTED=1
PWD=/usr/local/poudriere/data/.m/144i386-quarterly/07/.p
OUTPUT_REDIRECTED_STDOUT=3
P_PORTS_FEATURES=FLAVORS SUBPACKAGES SELECTED_OPTIONS
MASTERNAME=144i386-quarterly
SCRIPTPREFIX=/usr/local/share/poudriere
SCRIPTNAME=bulk.sh
OLDPWD=/usr/local/poudriere/data/.m/144i386-quarterly/ref/.p/pool
POUDRIERE_PKGNAME=poudriere-git-3.4.8-3-gd92fb7c0
SCRIPTPATH=/usr/local/share/poudriere/bulk.sh
POUDRIEREPATH=/usr/local/bin/poudriere
---End Environment---

---Begin Poudriere Port Flags/Env---
PORT_FLAGS=
PKGENV=
FLAVOR=py312
MAKE_ARGS= FLAVOR=py312
---End Poudriere Port Flags/Env---

---Begin OPTIONS List---
---End OPTIONS List---

--MAINTAINER--
elastic@FreeBSD.org
--End MAINTAINER--

--CONFIGURE_ARGS--

--End CONFIGURE_ARGS--

--CONFIGURE_ENV--
PYTHON="/usr/local/bin/python3.12" XDG_DATA_HOME=/wrkdirs/usr/ports/textproc/py-elasticsearch-curator/work-py312  XDG_CONFIG_HOME=/wrkdirs/usr/ports/textproc/py-elasticsearch-curator/work-py312  XDG_CACHE_HOME=/wrkdirs/usr/ports/textproc/py-elasticsearch-curator/work-py312/.cache  HOME=/wrkdirs/usr/ports/textproc/py-elasticsearch-curator/work-py312 TMPDIR="/tmp" PATH=/wrkdirs/usr/ports/textproc/py-elasticsearch-curator/work-py312/.bin:/sbin:/bin:/usr/sbin:/usr/bin:/usr/local/sbin:/usr/local/bin:/root/bin PKG_CONFIG_LIBDIR=/wrkdirs/usr/ports/textproc/py-elasticsearch-curator/work-py312/.pkgconfig:/usr/local/libdata/pkgconfig:/usr/local/share/pkgconfig:/usr/libdata/pkgconfig SHELL=/bin/sh CONFIG_SHELL=/bin/sh
--End CONFIGURE_ENV--

--MAKE_ENV--
XDG_DATA_HOME=/wrkdirs/usr/ports/textproc/py-elasticsearch-curator/work-py312  XDG_CONFIG_HOME=/wrkdirs/usr/ports/textproc/py-elasticsearch-curator/work-py312  XDG_CACHE_HOME=/wrkdirs/usr/ports/textproc/py-elasticsearch-curator/work-py312/.cache  HOME=/wrkdirs/usr/ports/textproc/py-elasticsearch-curator/work-py312 TMPDIR="/tmp" PATH=/wrkdirs/usr/ports/textproc/py-elasticsearch-curator/work-py312/.bin:/sbin:/bin:/usr/sbin:/usr/bin:/usr/local/sbin:/usr/local/bin:/root/bin PKG_CONFIG_LIBDIR=/wrkdirs/usr/ports/textproc/py-elasticsearch-curator/work-py312/.pkgconfig:/usr/local/libdata/pkgconfig:/usr/local/share/pkgconfig:/usr/libdata/pkgconfig MK_DEBUG_FILES=no MK_KERNEL_SYMBOLS=no SHELL=/bin/sh NO_LINT=YES LDSHARED="cc -shared" PYTHONDONTWRITEBYTECODE= PYTHONOPTIMIZE= PREFIX=/usr/local  LOCALBASE=/usr/local  CC="cc" CFLAGS="-O2 -pipe  -fstack-protector-strong -fno-strict-aliasing "  CPP="cpp" CPPFLAGS=""  LDFLAGS=" " LIBS=""  CXX="c++" CXXFLAGS="-O2 -pipe -fstack-protector-stron
g -fno-strict-aliasing  " BSD_INSTALL_PROGRAM="install  -s -m 555"  BSD_INSTALL_LIB="install  -s -m 0644"  BSD_INSTALL_SCRIPT="install  -m 555"  BSD_INSTALL_DATA="install  -m 0644"  BSD_INSTALL_MAN="install  -m 444"
--End MAKE_ENV--

--PLIST_SUB--
PYTHON_INCLUDEDIR=include/python3.12  PYTHON_LIBDIR=lib/python3.12  PYTHON_PLATFORM=freebsd14  PYTHON_SITELIBDIR=lib/python3.12/site-packages  PYTHON_SUFFIX=312  PYTHON_BASESUFFIX=312  PYTHON_TAG=.cpython-312  PYTHON_SOABI=.cpython-312  PYTHON_VER=3.12  PYTHON_BASEVER=3.12  PYTHON_VERSION=python3.12 PYTHON2="@comment " PYTHON3="" OSREL=14.4 PREFIX=%D LOCALBASE=/usr/local  RESETPREFIX=/usr/local LIB32DIR=lib DOCSDIR="share/doc/elasticsearch-curator"  EXAMPLESDIR="share/examples/elasticsearch-curator"  DATADIR="share/elasticsearch-curator"  WWWDIR="www/elasticsearch-curator"  ETCDIR="etc/elasticsearch-curator"
--End PLIST_SUB--

--SUB_LIST--
PYTHON_INCLUDEDIR=/usr/local/include/python3.12  PYTHON_LIBDIR=/usr/local/lib/python3.12  PYTHON_PLATFORM=freebsd14  PYTHON_SITELIBDIR=/usr/local/lib/python3.12/site-packages  PYTHON_SUFFIX=312  PYTHON_BASESUFFIX=312  PYTHON_TAG=.cpython-312  PYTHON_SOABI=.cpython-312  PYTHON_VER=3.12  PYTHON_BASEVER=3.12  PYTHON_VERSION=python3.12 PYTHON2="@comment " PYTHON3="" PREFIX=/usr/local LOCALBASE=/usr/local  DATADIR=/usr/local/share/elasticsearch-curator DOCSDIR=/usr/local/share/doc/elasticsearch-curator EXAMPLESDIR=/usr/local/share/examples/elasticsearch-curator  WWWDIR=/usr/local/www/elasticsearch-curator ETCDIR=/usr/local/etc/elasticsearch-curator
--End SUB_LIST--

---Begin make.conf---
USE_PACKAGE_DEPENDS=yes
BATCH=yes
WRKDIRPREFIX=/wrkdirs
PORTSDIR=/usr/ports
PACKAGES=/packages
DISTDIR=/distfiles
PACKAGE_BUILDING=yes
PACKAGE_BUILDING_FLAVORS=yes
MACHINE=i386
MACHINE_ARCH=i386
ARCH=${MACHINE_ARCH}
####  ####
# XXX: We really need this but cannot use it while 'make checksum' does not
# try the next mirror on checksum failure.  It currently retries the same
# failed mirror and then fails rather then trying another.  It *does*
# try the next if the size is mismatched though.
#MASTER_SITE_FREEBSD=yes
# Build ALLOW_MAKE_JOBS_PACKAGES with 3 jobs
MAKE_JOBS_NUMBER=3
#### Misc Poudriere ####
.include "/etc/make.conf.ports_env"
GID=0
UID=0
---End make.conf---
--Resource limits--
cpu time               (seconds, -t)  unlimited
file size           (512-blocks, -f)  unlimited
data seg size           (kbytes, -d)  524288
stack size              (kbytes, -s)  65536
core file size      (512-blocks, -c)  unlimited
max memory size         (kbytes, -m)  unlimited
locked memory           (kbytes, -l)  unlimited
max user processes              (-u)  89999
open files                      (-n)  8192
virtual mem size        (kbytes, -v)  unlimited
swap limit              (kbytes, -w)  unlimited
socket buffer size       (bytes, -b)  unlimited
pseudo-terminals                (-p)  unlimited
kqueues                         (-k)  unlimited
umtx shared locks               (-o)  unlimited
pipebuf                         (-y)  unlimited
--End resource limits--
=======================<phase: check-sanity   >============================
===== env: NO_DEPENDS=yes USER=root UID=0 GID=0
===>  License APACHE20 accepted by the user
===========================================================================
=======================<phase: pkg-depends    >============================
===== env: USE_PACKAGE_DEPENDS_ONLY=1 USER=root UID=0 GID=0
===>   py312-elasticsearch-curator-5.8.4_2 depends on file: /usr/local/sbin/pkg - not found
===>   Installing existing package /packages/All/pkg-2.8.4.pkg
[144i386-quarterly-job-07] Installing pkg-2.8.4...
[144i386-quarterly-job-07] Extracting pkg-2.8.4: .......... done
===>   py312-elasticsearch-curator-5.8.4_2 depends on file: /usr/local/sbin/pkg - found
===>   Returning to build of py312-elasticsearch-curator-5.8.4_2
===========================================================================
=======================<phase: fetch-depends  >============================
===== env: USE_PACKAGE_DEPENDS_ONLY=1 USER=root UID=0 GID=0
===========================================================================
=======================<phase: fetch          >============================
===== env: NO_DEPENDS=yes USER=root UID=0 GID=0
===>  License APACHE20 accepted by the user
===> Fetching all distfiles required by py312-elasticsearch-curator-5.8.4_2 for building
===========================================================================
=======================<phase: checksum       >============================
===== env: NO_DEPENDS=yes USER=root UID=0 GID=0
===>  License APACHE20 accepted by the user
===> Fetching all distfiles required by py312-elasticsearch-curator-5.8.4_2 for building
=> SHA256 Checksum OK for elastic-curator-v5.8.4_GH0.tar.gz.
===========================================================================
=======================<phase: extract-depends>============================
===== env: USE_PACKAGE_DEPENDS_ONLY=1 USER=root UID=0 GID=0
===========================================================================
=======================<phase: extract        >============================
===== env: NO_DEPENDS=yes USER=root UID=0 GID=0
===>  License APACHE20 accepted by the user
===> Fetching all distfiles required by py312-elasticsearch-curator-5.8.4_2 for building
===>  Extracting for py312-elasticsearch-curator-5.8.4_2
=> SHA256 Checksum OK for elastic-curator-v5.8.4_GH0.tar.gz.
===========================================================================
=======================<phase: patch-depends  >============================
===== env: USE_PACKAGE_DEPENDS_ONLY=1 USER=root UID=0 GID=0
===========================================================================
=======================<phase: patch          >============================
===== env: NO_DEPENDS=yes USER=root UID=0 GID=0
===>  Patching for py312-elasticsearch-curator-5.8.4_2
===>  Applying FreeBSD patches for py312-elasticsearch-curator-5.8.4_2 from /usr/ports/textproc/py-elasticsearch-curator/files
===========================================================================
=======================<phase: build-depends  >============================
===== env: USE_PACKAGE_DEPENDS_ONLY=1 USER=root UID=0 GID=0
===>   py312-elasticsearch-curator-5.8.4_2 depends on package: py312-boto3>=1.7.24 - not found
===>   Installing existing package /packages/All/py312-boto3-1.43.99.pkg
[144i386-quarterly-job-07] Installing py312-boto3-1.43.99...
[144i386-quarterly-job-07] `-- Installing py312-botocore-1.43.99...
[144i386-quarterly-job-07] |   `-- Installing py312-jmespath-1.1.0...
[144i386-quarterly-job-07] |   | `-- Installing python312-3.12.14_1...
[144i386-quarterly-job-07] |   |   `-- Installing expat-2.8.4...
[144i386-quarterly-job-07] |   |   `-- Extracting expat-2.8.4: .......... done
[144i386-quarterly-job-07] |   |   `-- Installing gettext-runtime-1.0_1...
[144i386-quarterly-job-07] |   |   | `-- Installing indexinfo-0.3.1_1...
[144i386-quarterly-job-07] |   |   | `-- Extracting indexinfo-0.3.1_1: .... done
[144i386-quarterly-job-07] |   |   `-- Extracting gettext-runtime-1.0_1: .......... done
[144i386-quarterly-job-07] |   |   `-- Installing libffi-3.8.0...
[144i386-quarterly-job-07] |   |   `-- Extracting libffi-3.8.0: .......... done
[144i386-quarterly-job-07] |   |   `-- Installing mpdecimal-4.0.1...
[144i386-quarterly-job-07] |   |   `-- Extracting mpdecimal-4.0.1: .......... done
[144i386-quarterly-job-07] |   |   `-- Installing readline-8.3.6...
[144i386-quarterly-job-07] |   |   `-- Extracting readline-8.3.6: .......... done
[144i386-quarterly-job-07] |   | `-- Extracting python312-3.12.14_1: .......... done
[144i386-quarterly-job-07] |   `-- Extracting py312-jmespath-1.1.0: .......... done
[144i386-quarterly-job-07] |   `-- Installing py312-python-dateutil-2.9.0...
[144i386-quarterly-job-07] |   | `-- Installing py312-six-1.17.0...
[144i386-quarterly-job-07] |   | `-- Extracting py312-six-1.17.0: .......... done
[144i386-quarterly-job-07] |   `-- Extracting py312-python-dateutil-2.9.0: .......... done
[144i386-quarterly-job-07] |   `-- Installing py312-urllib3-2.8.0,1...
[144i386-quarterly-job-07] |   | `-- Installing py312-pysocks-1.7.1_1...
[144i386-quarterly-job-07] |   | `-- Extracting py312-pysocks-1.7.1_1: .......... done
[144i386-quarterly-job-07] |   `-- Extracting py312-urllib3-2.8.0,1: .......... done
[144i386-quarterly-job-07] `-- Extracting py312-botocore-1.43.99: .......... done
[144i386-quarterly-job-07] `-- Installing py312-s3transfer-0.19.2...
[144i386-quarterly-job-07] `-- Extracting py312-s3transfer-0.19.2: .......... done
[144i386-quarterly-job-07] Extracting py312-boto3-1.43.99: .......... done
=====
Message from python312-3.12.14_1:

--
Note that some standard Python modules are provided as separate ports
as they require additional dependencies. They are available as:

py312-gdbm       databases/py-gdbm@py312
py312-sqlite3    databases/py-sqlite3@py312
py312-tkinter    x11-toolkits/py-tkinter@py312
=====
Message from py312-urllib3-2.8.0,1:

--
Since version 1.25 HTTPS connections are now verified by default which is done
via "cert_reqs = 'CERT_REQUIRED'".  While certificate verification can be
disabled via "cert_reqs = 'CERT_NONE'", it's highly recommended to leave it on.

Various consumers of net/py-urllib3 already have implemented routines that
either explicitly enable or disable HTTPS certificate verification (e.g. via
configuration settings, CLI arguments, etc.).

Yet it may happen that there are still some consumers which don't explicitly
enable/disable certificate verification for HTTPS connections which could then
lead to errors (as is often the case with self-signed certificates).

In case of an error one should try first to temporarily disable certificate
verification of the problematic urllib3 consumer to see if that approach will
remedy the issue.
===>   py312-elasticsearch-curator-5.8.4_2 depends on package: py312-boto3>=1.7.24 - found
===>   Returning to build of py312-elasticsearch-curator-5.8.4_2
===>   py312-elasticsearch-curator-5.8.4_2 depends on package: py312-certifi>=2018.10.15 - not found
===>   Installing existing package /packages/All/py312-certifi-2026.7.22.pkg
[144i386-quarterly-job-07] Installing py312-certifi-2026.7.22...
[144i386-quarterly-job-07] Extracting py312-certifi-2026.7.22: .......... done
===>   py312-elasticsearch-curator-5.8.4_2 depends on package: py312-certifi>=2018.10.15 - found
===>   Returning to build of py312-elasticsearch-curator-5.8.4_2
===>   py312-elasticsearch-curator-5.8.4_2 depends on package: py312-click7>=7.1.2 - not found
===>   Installing existing package /packages/All/py312-click7-7.1.2_1.pkg
[144i386-quarterly-job-07] Installing py312-click7-7.1.2_1...
[144i386-quarterly-job-07] Extracting py312-click7-7.1.2_1: .......... done
===>   py312-elasticsearch-curator-5.8.4_2 depends on package: py312-click7>=7.1.2 - found
===>   Returning to build of py312-elasticsearch-curator-5.8.4_2
===>   py312-elasticsearch-curator-5.8.4_2 depends on package: py312-elasticsearch>=7.15.1 - not found
===>   Installing existing package /packages/All/py312-elasticsearch-9.5.1.pkg
[144i386-quarterly-job-07] Installing py312-elasticsearch-9.5.1...
[144i386-quarterly-job-07] `-- Installing py312-anyio-4.15.1...
[144i386-quarterly-job-07] |   `-- Installing py312-idna-3.20...
[144i386-quarterly-job-07] |   `-- Extracting py312-idna-3.20: .......... done
[144i386-quarterly-job-07] |   `-- Installing py312-truststore-0.10.4_1...
[144i386-quarterly-job-07] |   `-- Extracting py312-truststore-0.10.4_1: .......... done
[144i386-quarterly-job-07] |   `-- Installing py312-typing-extensions-4.16.0...
[144i386-quarterly-job-07] |   `-- Extracting py312-typing-extensions-4.16.0: .......... done
[144i386-quarterly-job-07] `-- Extracting py312-anyio-4.15.1: .......... done
[144i386-quarterly-job-07] `-- Installing py312-elastic-transport-9.4.2...
[144i386-quarterly-job-07] |   `-- Installing py312-sniffio-1.3.1...
[144i386-quarterly-job-07] |   `-- Extracting py312-sniffio-1.3.1: .......... done
[144i386-quarterly-job-07] `-- Extracting py312-elastic-transport-9.4.2: .......... done
[144i386-quarterly-job-07] `-- Installing py312-requests-2.34.2...
[144i386-quarterly-job-07] |   `-- Installing py312-charset-normalizer-3.5.1...
[144i386-quarterly-job-07] |   `-- Extracting py312-charset-normalizer-3.5.1: .......... done
[144i386-quarterly-job-07] `-- Extracting py312-requests-2.34.2: .......... done
[144i386-quarterly-job-07] Extracting py312-elasticsearch-9.5.1: .......... done
===>   py312-elasticsearch-curator-5.8.4_2 depends on package: py312-elasticsearch>=7.15.1 - found
===>   Returning to build of py312-elasticsearch-curator-5.8.4_2
===>   py312-elasticsearch-curator-5.8.4_2 depends on package: py312-requests-aws4auth>=0.9 - not found
===>   Installing existing package /packages/All/py312-requests-aws4auth-1.3.2.pkg
[144i386-quarterly-job-07] Installing py312-requests-aws4auth-1.3.2...
[144i386-quarterly-job-07] Extracting py312-requests-aws4auth-1.3.2: .......... done
===>   py312-elasticsearch-curator-5.8.4_2 depends on package: py312-requests-aws4auth>=0.9 - found
===>   Returning to build of py312-elasticsearch-curator-5.8.4_2
===>   py312-elasticsearch-curator-5.8.4_2 depends on package: py312-six>=1.11.0 - found
===>   py312-elasticsearch-curator-5.8.4_2 depends on package: py312-urllib3>=1.26.4 - found
===>   py312-elasticsearch-curator-5.8.4_2 depends on package: py312-voluptuous>=0.9.3 - not found
===>   Installing existing package /packages/All/py312-voluptuous-0.16.0.pkg
[144i386-quarterly-job-07] Installing py312-voluptuous-0.16.0...
[144i386-quarterly-job-07] Extracting py312-voluptuous-0.16.0: .......... done
===>   py312-elasticsearch-curator-5.8.4_2 depends on package: py312-voluptuous>=0.9.3 - found
===>   Returning to build of py312-elasticsearch-curator-5.8.4_2
===>   py312-elasticsearch-curator-5.8.4_2 depends on package: py312-pyyaml>=3.10 - not found
===>   Installing existing package /packages/All/py312-pyyaml-6.0.3_1.pkg
[144i386-quarterly-job-07] Installing py312-pyyaml-6.0.3_1...
[144i386-quarterly-job-07] `-- Installing libyaml-0.2.5...
[144i386-quarterly-job-07] `-- Extracting libyaml-0.2.5: ......... done
[144i386-quarterly-job-07] Extracting py312-pyyaml-6.0.3_1: .......... done
===>   py312-elasticsearch-curator-5.8.4_2 depends on package: py312-pyyaml>=3.10 - found
===>   Returning to build of py312-elasticsearch-curator-5.8.4_2
===>   py312-elasticsearch-curator-5.8.4_2 depends on file: /usr/local/bin/python3.12 - found
===>   py312-elasticsearch-curator-5.8.4_2 depends on package: py312-setuptools>=63.1.0 - not found
===>   Installing existing package /packages/All/py312-setuptools-63.1.0_3.pkg
[144i386-quarterly-job-07] Installing py312-setuptools-63.1.0_3...
[144i386-quarterly-job-07] Extracting py312-setuptools-63.1.0_3: .......... done
===>   py312-elasticsearch-curator-5.8.4_2 depends on package: py312-setuptools>=63.1.0 - found
===>   Returning to build of py312-elasticsearch-curator-5.8.4_2
===>   py312-elasticsearch-curator-5.8.4_2 depends on file: /usr/local/bin/python3.12 - found
===========================================================================
=======================<phase: lib-depends    >============================
===== env: USE_PACKAGE_DEPENDS_ONLY=1 USER=root UID=0 GID=0
===========================================================================
=======================<phase: configure      >============================
===== env: NO_DEPENDS=yes USER=root UID=0 GID=0
===>  Configuring for py312-elasticsearch-curator-5.8.4_2
/usr/local/lib/python3.12/site-packages/setuptools/installer.py:27: SetuptoolsDeprecationWarning: setuptools.installer is deprecated. Requirements should be satisfied by a PEP 517 installer.
  warnings.warn(
WARNING: The wheel package is not available.
/usr/local/bin/python3.12: No module named pip
Traceback (most recent call last):
  File "setup.py", line 39, in <module>
    from cx_Freeze import setup, Executable
ModuleNotFoundError: No module named 'cx_Freeze'

During handling of the above exception, another exception occurred:

Traceback (most recent call last):
  File "/usr/local/lib/python3.12/site-packages/setuptools/installer.py", line 82, in fetch_build_egg
    subprocess.check_call(cmd)
  File "/usr/local/lib/python3.12/subprocess.py", line 413, in check_call
    raise CalledProcessError(retcode, cmd)
subprocess.CalledProcessError: Command '['/usr/local/bin/python3.12', '-m', 'pip', '--disable-pip-version-check', 'wheel', '--no-deps', '-w', '/tmp/tmplr8maoni', '--quiet', 'elasticsearch<8.0.0,>=7.12.0']' returned non-zero exit status 1.

The above exception was the direct cause of the following exception:

Traceback (most recent call last):
  File "<string>", line 1, in <module>
  File "setup.py", line 144, in <module>
    setup(
  File "/usr/local/lib/python3.12/site-packages/setuptools/__init__.py", line 86, in setup
    _install_setup_requires(attrs)
  File "/usr/local/lib/python3.12/site-packages/setuptools/__init__.py", line 80, in _install_setup_requires
    dist.fetch_build_eggs(dist.setup_requires)
  File "/usr/local/lib/python3.12/site-packages/setuptools/dist.py", line 875, in fetch_build_eggs
    resolved_dists = pkg_resources.working_set.resolve(
                     ^^^^^^^^^^^^^^^^^^^^^^^^^^^^^^^^^^
  File "/usr/local/lib/python3.12/site-packages/pkg_resources/__init__.py", line 789, in resolve
    dist = best[req.key] = env.best_match(
                           ^^^^^^^^^^^^^^^
  File "/usr/local/lib/python3.12/site-packages/pkg_resources/__init__.py", line 1075, in best_match
    return self.obtain(req, installer)
           ^^^^^^^^^^^^^^^^^^^^^^^^^^^
  File "/usr/local/lib/python3.12/site-packages/pkg_resources/__init__.py", line 1087, in obtain
    return installer(requirement)
           ^^^^^^^^^^^^^^^^^^^^^^
  File "/usr/local/lib/python3.12/site-packages/setuptools/dist.py", line 945, in fetch_build_egg
    return fetch_build_egg(self, req)
           ^^^^^^^^^^^^^^^^^^^^^^^^^^
  File "/usr/local/lib/python3.12/site-packages/setuptools/installer.py", line 84, in fetch_build_egg
    raise DistutilsError(str(e)) from e
distutils.errors.DistutilsError: Command '['/usr/local/bin/python3.12', '-m', 'pip', '--disable-pip-version-check', 'wheel', '--no-deps', '-w', '/tmp/tmplr8maoni', '--quiet', 'elasticsearch<8.0.0,>=7.12.0']' returned non-zero exit status 1.
*** Error code 1

Stop.
make: stopped making "configure" in /usr/ports/textproc/py-elasticsearch-curator

From nobody Tue Oct  6 00:41:52 2026
X-Original-To: elastic@mlmmj.nyi.freebsd.org
Received: from mx1.freebsd.org (mx1.freebsd.org [IPv6:2610:1c1:1:606c::19:1])
	by mlmmj.nyi.freebsd.org (Postfix) with ESMTP id 4hzHWj5jTzz6vhJD
	for <elastic@mlmmj.nyi.freebsd.org>; Tue, 06 Oct 2026 00:41:53 +0000 (UTC)
	(envelope-from pkg-fallout@FreeBSD.org)
Received: from mxrelay.chi.freebsd.org (mxrelay.chi.freebsd.org [IPv6:2610:1c0:1040:6064::19:3])
	(using TLSv1.3 with cipher TLS_AES_256_GCM_SHA384 (256/256 bits)
	 key-exchange x25519 server-signature RSA-PSS (4096 bits) server-digest SHA256
	 client-signature ECDSA (prime256v1) client-digest SHA256)
	(Client CN "mxrelay.chi.freebsd.org", Issuer "YE2" (not verified))
	by mx1.freebsd.org (Postfix) with ESMTPS id 4hzHWj08wFz4LGY
	for <elastic@FreeBSD.org>; Tue, 06 Oct 2026 00:41:53 +0000 (UTC)
	(envelope-from pkg-fallout@FreeBSD.org)
ARC-Seal: i=1; a=rsa-sha256; d=freebsd.org; s=dkim; cv=none; t=1791247313;
	b=dzB5Wcc4YiH7Y+F2BtZdvb2uizQ+JBDVgJjE86s3iLdK8lBljCxqTbE981hJyGp1kHmiBH
	yLF4MjonR5FonfxcVLxIf/uvfqirYRwSchrsj8PUunSpd/0gUq1fhHptmFudDc4uZQ2ld6
	M4yU3crU/nlzJv50h6ZV2zF6YrEpO6iwISqLEV2/+uWlw32Phslho9GQELIBUfTK6fN6My
	iUx3MuGu6xewiA8k3AtJLk3W7cEMAmtFJlbIQD6/Nm5rD9LcVr1t6gZRGG7/+dejd7Z/om
	XmrTSHe6Ltx1dISYv8Vhb8RQ+nk9usMHiEu04HPOA/jxJXHQi7CyFtDsDtW4Bg==
ARC-Message-Signature: i=1; a=rsa-sha256; c=relaxed/relaxed; d=freebsd.org;
	s=dkim; t=1791247313;
	h=from:from:reply-to:subject:subject:date:date:message-id:message-id:
	 to:to:cc:cc; bh=M/RCZF7t9okHYi5JIxzTv0jZcNRAJlqIqHcmu2ZvNwQ=;
	b=m6IxvUeOfCIlLVdy4Yq34AE9d2U0CbcRHrWGCx45/C4uWSZeXnXe+1Cwap4l4Yw2Ys+Lzz
	92dRGhy2bQhnZ0pH89O/Cx04yKCBF84ZGadSQobnVeU/j+0AeqU+MOqMsyddAgknSV3yzu
	icXODJslR9qWBIpdsaNrGcyWPU+kzBd1jMEDIXcRnazGMrYAYTgMi/tGz6dAm4VoTfVKSQ
	GXRVZiEWjFdrEaQqk2dwWsvKYeCNorI5e8XX2NAHfqxUAlyCGu4XCo1ECnb7CiwdvTwxmm
	MTtOo6WxjQ93H/RsA5ZVzqNTomh6UPl76rhQFnFdI7C9ylvrBqYkVU0rM+aW/w==
ARC-Authentication-Results: i=1;
	mx1.freebsd.org;
	none
Received: from beefy22.chi.freebsd.org (beefy22.chi.freebsd.org [IPv6:2610:1c0:1040:6080::16:16])
	by mxrelay.chi.freebsd.org (Postfix) with ESMTP id C2B4B141A3
	for <elastic@FreeBSD.org>; Tue, 06 Oct 2026 00:41:52 +0000 (UTC)
	(envelope-from pkg-fallout@FreeBSD.org)
Received: from root (uid 0)
	(envelope-from pkg-fallout@FreeBSD.org)
	id 308c
	by beefy22.chi.freebsd.org (DragonFly Mail Agent v0.13+ on beefy22.chi.freebsd.org);
	Tue, 06 Oct 2026 00:41:52 +0000
To: elastic@FreeBSD.org
Subject: [package - 144amd64-default][textproc/py-elasticsearch-curator] Failed for py312-elasticsearch-curator-5.8.4_2 in configure
Cc: pkg-fallout@FreeBSD.org
Date: Tue, 06 Oct 2026 00:41:52 +0000
Message-Id: <6ac443d0.308c.2e3d8df5@beefy22.chi.freebsd.org>
From: <pkg-fallout@FreeBSD.org>
List-Id: Support of ElasticSearch-related ports <freebsd-elastic.freebsd.org>
List-Archive: https://lists.freebsd.org/archives/freebsd-elastic
List-Help: <mailto:freebsd-elastic+help@freebsd.org>
List-Post: <mailto:freebsd-elastic@freebsd.org>
List-Subscribe: <mailto:freebsd-elastic+subscribe@freebsd.org>
List-Unsubscribe: <mailto:freebsd-elastic+unsubscribe@freebsd.org>
Sender: owner-freebsd-elastic@FreeBSD.org
List-Id: <freebsd-elastic.FreeBSD.org>
List-Post: <mailto:freebsd-elastic@FreeBSD.org>
List-Help: <mailto:freebsd-elastic+help@FreeBSD.org>
List-Subscribe: <mailto:freebsd-elastic+subscribe@FreeBSD.org>
List-Unsubscribe: <mailto:freebsd-elastic+unsubscribe@FreeBSD.org>
List-Owner: <mailto:postmaster@FreeBSD.org>
Precedence: list

You are receiving this mail as a port that you maintain
is failing to build on the FreeBSD package build server.
Please investigate the failure and submit a PR to fix
build.

Maintainer:     elastic@FreeBSD.org
Log URL:        https://pkg-status.freebsd.org/beefy22/data/144amd64-default/2208b8828a2c/logs/py312-elasticsearch-curator-5.8.4_2.log
Build URL:      https://pkg-status.freebsd.org/beefy22/build.html?mastername=144amd64-default&build=2208b8828a2c
Log:

=>> Building textproc/py-elasticsearch-curator
build started at Tue Oct  6 00:41:47 UTC 2026
port directory: /usr/ports/textproc/py-elasticsearch-curator
package name: py312-elasticsearch-curator-5.8.4_2
building for: FreeBSD 144amd64-default-job-31 14.4-RELEASE-p10 FreeBSD 14.4-RELEASE-p10 amd64
maintained by: elastic@FreeBSD.org
Makefile datestamp: -rw-r--r--  1 root wheel 1203 Mar 11  2025 /usr/ports/textproc/py-elasticsearch-curator/Makefile
Ports top last git commit: 2208b8828a2c4683ef0d87f4a8d2785324faefba
Ports top unclean checkout: no
Port dir last git commit: 06a08e69f3acb846ad8252945f53c3a2d211e303
Port dir unclean checkout: no
Poudriere version: poudriere-git-3.4.8-3-gd92fb7c0
Host OSVERSION: 1600022
Jail OSVERSION: 1404000
Job Id: 31

---Begin Environment---
SHELL=/bin/sh
OSVERSION=1404000
UNAME_v=FreeBSD 14.4-RELEASE-p10
UNAME_r=14.4-RELEASE-p10
BLOCKSIZE=K
MAIL=/var/mail/root
MM_CHARSET=UTF-8
LANG=C.UTF-8
STATUS=1
HOME=/root
PATH=/sbin:/bin:/usr/sbin:/usr/bin:/usr/local/sbin:/usr/local/bin:/root/bin
MAKE_OBJDIR_CHECK_WRITABLE=0
LOCALBASE=/usr/local
USER=root
POUDRIERE_NAME=poudriere-git
LIBEXECPREFIX=/usr/local/libexec/poudriere
POUDRIERE_VERSION=3.4.8-3-gd92fb7c0
MASTERMNT=/usr/local/poudriere/data/.m/144amd64-default/ref
LC_COLLATE=C
POUDRIERE_BUILD_TYPE=bulk
PACKAGE_BUILDING=yes
SAVED_TERM=
OUTPUT_REDIRECTED_STDERR=4
OUTPUT_REDIRECTED=1
PWD=/usr/local/poudriere/data/.m/144amd64-default/31/.p
OUTPUT_REDIRECTED_STDOUT=3
P_PORTS_FEATURES=FLAVORS SUBPACKAGES SELECTED_OPTIONS
MASTERNAME=144amd64-default
SCRIPTPREFIX=/usr/local/share/poudriere
SCRIPTNAME=bulk.sh
OLDPWD=/usr/local/poudriere/data/.m/144amd64-default/ref/.p/pool
POUDRIERE_PKGNAME=poudriere-git-3.4.8-3-gd92fb7c0
SCRIPTPATH=/usr/local/share/poudriere/bulk.sh
POUDRIEREPATH=/usr/local/bin/poudriere
---End Environment---

---Begin Poudriere Port Flags/Env---
PORT_FLAGS=
PKGENV=
FLAVOR=py312
MAKE_ARGS= FLAVOR=py312
---End Poudriere Port Flags/Env---

---Begin OPTIONS List---
---End OPTIONS List---

--MAINTAINER--
elastic@FreeBSD.org
--End MAINTAINER--

--CONFIGURE_ARGS--

--End CONFIGURE_ARGS--

--CONFIGURE_ENV--
PYTHON="/usr/local/bin/python3.12" XDG_DATA_HOME=/wrkdirs/usr/ports/textproc/py-elasticsearch-curator/work-py312  XDG_CONFIG_HOME=/wrkdirs/usr/ports/textproc/py-elasticsearch-curator/work-py312  XDG_CACHE_HOME=/wrkdirs/usr/ports/textproc/py-elasticsearch-curator/work-py312/.cache  HOME=/wrkdirs/usr/ports/textproc/py-elasticsearch-curator/work-py312 TMPDIR="/tmp" PATH=/wrkdirs/usr/ports/textproc/py-elasticsearch-curator/work-py312/.bin:/sbin:/bin:/usr/sbin:/usr/bin:/usr/local/sbin:/usr/local/bin:/root/bin PKG_CONFIG_LIBDIR=/wrkdirs/usr/ports/textproc/py-elasticsearch-curator/work-py312/.pkgconfig:/usr/local/libdata/pkgconfig:/usr/local/share/pkgconfig:/usr/libdata/pkgconfig SHELL=/bin/sh CONFIG_SHELL=/bin/sh
--End CONFIGURE_ENV--

--MAKE_ENV--
XDG_DATA_HOME=/wrkdirs/usr/ports/textproc/py-elasticsearch-curator/work-py312  XDG_CONFIG_HOME=/wrkdirs/usr/ports/textproc/py-elasticsearch-curator/work-py312  XDG_CACHE_HOME=/wrkdirs/usr/ports/textproc/py-elasticsearch-curator/work-py312/.cache  HOME=/wrkdirs/usr/ports/textproc/py-elasticsearch-curator/work-py312 TMPDIR="/tmp" PATH=/wrkdirs/usr/ports/textproc/py-elasticsearch-curator/work-py312/.bin:/sbin:/bin:/usr/sbin:/usr/bin:/usr/local/sbin:/usr/local/bin:/root/bin PKG_CONFIG_LIBDIR=/wrkdirs/usr/ports/textproc/py-elasticsearch-curator/work-py312/.pkgconfig:/usr/local/libdata/pkgconfig:/usr/local/share/pkgconfig:/usr/libdata/pkgconfig MK_DEBUG_FILES=no MK_KERNEL_SYMBOLS=no SHELL=/bin/sh NO_LINT=YES LDSHARED="cc -shared" PYTHONDONTWRITEBYTECODE= PYTHONOPTIMIZE= PREFIX=/usr/local  LOCALBASE=/usr/local  CC="cc" CFLAGS="-O2 -pipe  -fstack-protector-strong -fno-strict-aliasing "  CPP="cpp" CPPFLAGS=""  LDFLAGS=" " LIBS=""  CXX="c++" CXXFLAGS="-O2 -pipe -fstack-protector-stron
g -fno-strict-aliasing  " BSD_INSTALL_PROGRAM="install  -s -m 555"  BSD_INSTALL_LIB="install  -s -m 0644"  BSD_INSTALL_SCRIPT="install  -m 555"  BSD_INSTALL_DATA="install  -m 0644"  BSD_INSTALL_MAN="install  -m 444"
--End MAKE_ENV--

--PLIST_SUB--
PYTHON_INCLUDEDIR=include/python3.12  PYTHON_LIBDIR=lib/python3.12  PYTHON_PLATFORM=freebsd14  PYTHON_SITELIBDIR=lib/python3.12/site-packages  PYTHON_SUFFIX=312  PYTHON_BASESUFFIX=312  PYTHON_TAG=.cpython-312  PYTHON_SOABI=.cpython-312  PYTHON_VER=3.12  PYTHON_BASEVER=3.12  PYTHON_VERSION=python3.12 PYTHON2="@comment " PYTHON3="" OSREL=14.4 PREFIX=%D LOCALBASE=/usr/local  RESETPREFIX=/usr/local LIB32DIR=lib DOCSDIR="share/doc/elasticsearch-curator"  EXAMPLESDIR="share/examples/elasticsearch-curator"  DATADIR="share/elasticsearch-curator"  WWWDIR="www/elasticsearch-curator"  ETCDIR="etc/elasticsearch-curator"
--End PLIST_SUB--

--SUB_LIST--
PYTHON_INCLUDEDIR=/usr/local/include/python3.12  PYTHON_LIBDIR=/usr/local/lib/python3.12  PYTHON_PLATFORM=freebsd14  PYTHON_SITELIBDIR=/usr/local/lib/python3.12/site-packages  PYTHON_SUFFIX=312  PYTHON_BASESUFFIX=312  PYTHON_TAG=.cpython-312  PYTHON_SOABI=.cpython-312  PYTHON_VER=3.12  PYTHON_BASEVER=3.12  PYTHON_VERSION=python3.12 PYTHON2="@comment " PYTHON3="" PREFIX=/usr/local LOCALBASE=/usr/local  DATADIR=/usr/local/share/elasticsearch-curator DOCSDIR=/usr/local/share/doc/elasticsearch-curator EXAMPLESDIR=/usr/local/share/examples/elasticsearch-curator  WWWDIR=/usr/local/www/elasticsearch-curator ETCDIR=/usr/local/etc/elasticsearch-curator
--End SUB_LIST--

---Begin make.conf---
USE_PACKAGE_DEPENDS=yes
BATCH=yes
WRKDIRPREFIX=/wrkdirs
PORTSDIR=/usr/ports
PACKAGES=/packages
DISTDIR=/distfiles
PACKAGE_BUILDING=yes
PACKAGE_BUILDING_FLAVORS=yes
####  ####
# XXX: We really need this but cannot use it while 'make checksum' does not
# try the next mirror on checksum failure.  It currently retries the same
# failed mirror and then fails rather then trying another.  It *does*
# try the next if the size is mismatched though.
#MASTER_SITE_FREEBSD=yes
# Build ALLOW_MAKE_JOBS_PACKAGES with 3 jobs
MAKE_JOBS_NUMBER=3
#### Misc Poudriere ####
.include "/etc/make.conf.ports_env"
GID=0
UID=0
DISABLE_MAKE_JOBS=poudriere
---End make.conf---
--Resource limits--
cpu time               (seconds, -t)  unlimited
file size           (512-blocks, -f)  unlimited
data seg size           (kbytes, -d)  33554432
stack size              (kbytes, -s)  524288
core file size      (512-blocks, -c)  unlimited
max memory size         (kbytes, -m)  unlimited
locked memory           (kbytes, -l)  unlimited
max user processes              (-u)  89999
open files                      (-n)  8192
virtual mem size        (kbytes, -v)  unlimited
swap limit              (kbytes, -w)  unlimited
socket buffer size       (bytes, -b)  unlimited
pseudo-terminals                (-p)  unlimited
kqueues                         (-k)  unlimited
umtx shared locks               (-o)  unlimited
pipebuf                         (-y)  unlimited
--End resource limits--
=======================<phase: check-sanity   >============================
===== env: NO_DEPENDS=yes USER=root UID=0 GID=0
===>  License APACHE20 accepted by the user
===========================================================================
=======================<phase: pkg-depends    >============================
===== env: USE_PACKAGE_DEPENDS_ONLY=1 USER=root UID=0 GID=0
===>   py312-elasticsearch-curator-5.8.4_2 depends on file: /usr/local/sbin/pkg - not found
===>   Installing existing package /packages/All/pkg-2.8.4.pkg
[144amd64-default-job-31] Installing pkg-2.8.4...
[144amd64-default-job-31] Extracting pkg-2.8.4: .......... done
===>   py312-elasticsearch-curator-5.8.4_2 depends on file: /usr/local/sbin/pkg - found
===>   Returning to build of py312-elasticsearch-curator-5.8.4_2
===========================================================================
=======================<phase: fetch-depends  >============================
===== env: USE_PACKAGE_DEPENDS_ONLY=1 USER=root UID=0 GID=0
===========================================================================
=======================<phase: fetch          >============================
===== env: NO_DEPENDS=yes USER=root UID=0 GID=0
===>  License APACHE20 accepted by the user
===> Fetching all distfiles required by py312-elasticsearch-curator-5.8.4_2 for building
===========================================================================
=======================<phase: checksum       >============================
===== env: NO_DEPENDS=yes USER=root UID=0 GID=0
===>  License APACHE20 accepted by the user
===> Fetching all distfiles required by py312-elasticsearch-curator-5.8.4_2 for building
=> SHA256 Checksum OK for elastic-curator-v5.8.4_GH0.tar.gz.
===========================================================================
=======================<phase: extract-depends>============================
===== env: USE_PACKAGE_DEPENDS_ONLY=1 USER=root UID=0 GID=0
===========================================================================
=======================<phase: extract        >============================
===== env: NO_DEPENDS=yes USER=root UID=0 GID=0
===>  License APACHE20 accepted by the user
===> Fetching all distfiles required by py312-elasticsearch-curator-5.8.4_2 for building
===>  Extracting for py312-elasticsearch-curator-5.8.4_2
=> SHA256 Checksum OK for elastic-curator-v5.8.4_GH0.tar.gz.
===========================================================================
=======================<phase: patch-depends  >============================
===== env: USE_PACKAGE_DEPENDS_ONLY=1 USER=root UID=0 GID=0
===========================================================================
=======================<phase: patch          >============================
===== env: NO_DEPENDS=yes USER=root UID=0 GID=0
===>  Patching for py312-elasticsearch-curator-5.8.4_2
===>  Applying FreeBSD patches for py312-elasticsearch-curator-5.8.4_2 from /usr/ports/textproc/py-elasticsearch-curator/files
===========================================================================
=======================<phase: build-depends  >============================
===== env: USE_PACKAGE_DEPENDS_ONLY=1 USER=root UID=0 GID=0
===>   py312-elasticsearch-curator-5.8.4_2 depends on package: py312-boto3>=1.7.24 - not found
===>   Installing existing package /packages/All/py312-boto3-1.43.99.pkg
[144amd64-default-job-31] Installing py312-boto3-1.43.99...
[144amd64-default-job-31] `-- Installing py312-botocore-1.43.99...
[144amd64-default-job-31] |   `-- Installing py312-jmespath-1.1.0...
[144amd64-default-job-31] |   | `-- Installing python312-3.12.14_1...
[144amd64-default-job-31] |   |   `-- Installing expat-2.8.4...
[144amd64-default-job-31] |   |   `-- Extracting expat-2.8.4: .......... done
[144amd64-default-job-31] |   |   `-- Installing gettext-runtime-1.0_1...
[144amd64-default-job-31] |   |   | `-- Installing indexinfo-0.3.1_1...
[144amd64-default-job-31] |   |   | `-- Extracting indexinfo-0.3.1_1: .... done
[144amd64-default-job-31] |   |   `-- Extracting gettext-runtime-1.0_1: .......... done
[144amd64-default-job-31] |   |   `-- Installing libffi-3.8.0...
[144amd64-default-job-31] |   |   `-- Extracting libffi-3.8.0: .......... done
[144amd64-default-job-31] |   |   `-- Installing mpdecimal-4.0.1...
[144amd64-default-job-31] |   |   `-- Extracting mpdecimal-4.0.1: .......... done
[144amd64-default-job-31] |   |   `-- Installing readline-8.3.6...
[144amd64-default-job-31] |   |   `-- Extracting readline-8.3.6: .......... done
[144amd64-default-job-31] |   | `-- Extracting python312-3.12.14_1: .......... done
[144amd64-default-job-31] |   `-- Extracting py312-jmespath-1.1.0: .......... done
[144amd64-default-job-31] |   `-- Installing py312-python-dateutil-2.9.0...
[144amd64-default-job-31] |   | `-- Installing py312-six-1.17.0...
[144amd64-default-job-31] |   | `-- Extracting py312-six-1.17.0: .......... done
[144amd64-default-job-31] |   `-- Extracting py312-python-dateutil-2.9.0: .......... done
[144amd64-default-job-31] |   `-- Installing py312-urllib3-2.8.0,1...
[144amd64-default-job-31] |   | `-- Installing py312-pysocks-1.7.1_1...
[144amd64-default-job-31] |   | `-- Extracting py312-pysocks-1.7.1_1: .......... done
[144amd64-default-job-31] |   `-- Extracting py312-urllib3-2.8.0,1: .......... done
[144amd64-default-job-31] `-- Extracting py312-botocore-1.43.99: .......... done
[144amd64-default-job-31] `-- Installing py312-s3transfer-0.19.2...
[144amd64-default-job-31] `-- Extracting py312-s3transfer-0.19.2: .......... done
[144amd64-default-job-31] Extracting py312-boto3-1.43.99: .......... done
=====
Message from python312-3.12.14_1:

--
Note that some standard Python modules are provided as separate ports
as they require additional dependencies. They are available as:

py312-gdbm       databases/py-gdbm@py312
py312-sqlite3    databases/py-sqlite3@py312
py312-tkinter    x11-toolkits/py-tkinter@py312
=====
Message from py312-urllib3-2.8.0,1:

--
Since version 1.25 HTTPS connections are now verified by default which is done
via "cert_reqs = 'CERT_REQUIRED'".  While certificate verification can be
disabled via "cert_reqs = 'CERT_NONE'", it's highly recommended to leave it on.

Various consumers of net/py-urllib3 already have implemented routines that
either explicitly enable or disable HTTPS certificate verification (e.g. via
configuration settings, CLI arguments, etc.).

Yet it may happen that there are still some consumers which don't explicitly
enable/disable certificate verification for HTTPS connections which could then
lead to errors (as is often the case with self-signed certificates).

In case of an error one should try first to temporarily disable certificate
verification of the problematic urllib3 consumer to see if that approach will
remedy the issue.
===>   py312-elasticsearch-curator-5.8.4_2 depends on package: py312-boto3>=1.7.24 - found
===>   Returning to build of py312-elasticsearch-curator-5.8.4_2
===>   py312-elasticsearch-curator-5.8.4_2 depends on package: py312-certifi>=2018.10.15 - not found
===>   Installing existing package /packages/All/py312-certifi-2026.7.22.pkg
[144amd64-default-job-31] Installing py312-certifi-2026.7.22...
[144amd64-default-job-31] Extracting py312-certifi-2026.7.22: .......... done
===>   py312-elasticsearch-curator-5.8.4_2 depends on package: py312-certifi>=2018.10.15 - found
===>   Returning to build of py312-elasticsearch-curator-5.8.4_2
===>   py312-elasticsearch-curator-5.8.4_2 depends on package: py312-click7>=7.1.2 - not found
===>   Installing existing package /packages/All/py312-click7-7.1.2_1.pkg
[144amd64-default-job-31] Installing py312-click7-7.1.2_1...
[144amd64-default-job-31] Extracting py312-click7-7.1.2_1: .......... done
===>   py312-elasticsearch-curator-5.8.4_2 depends on package: py312-click7>=7.1.2 - found
===>   Returning to build of py312-elasticsearch-curator-5.8.4_2
===>   py312-elasticsearch-curator-5.8.4_2 depends on package: py312-elasticsearch>=7.15.1 - not found
===>   Installing existing package /packages/All/py312-elasticsearch-9.5.1.pkg
[144amd64-default-job-31] Installing py312-elasticsearch-9.5.1...
[144amd64-default-job-31] `-- Installing py312-anyio-4.15.1...
[144amd64-default-job-31] |   `-- Installing py312-idna-3.20...
[144amd64-default-job-31] |   `-- Extracting py312-idna-3.20: .......... done
[144amd64-default-job-31] |   `-- Installing py312-truststore-0.10.4_1...
[144amd64-default-job-31] |   `-- Extracting py312-truststore-0.10.4_1: .......... done
[144amd64-default-job-31] |   `-- Installing py312-typing-extensions-4.16.0...
[144amd64-default-job-31] |   `-- Extracting py312-typing-extensions-4.16.0: .......... done
[144amd64-default-job-31] `-- Extracting py312-anyio-4.15.1: .......... done
[144amd64-default-job-31] `-- Installing py312-elastic-transport-9.4.2...
[144amd64-default-job-31] |   `-- Installing py312-sniffio-1.3.1...
[144amd64-default-job-31] |   `-- Extracting py312-sniffio-1.3.1: .......... done
[144amd64-default-job-31] `-- Extracting py312-elastic-transport-9.4.2: .......... done
[144amd64-default-job-31] `-- Installing py312-requests-2.34.2...
[144amd64-default-job-31] |   `-- Installing py312-charset-normalizer-3.5.1...
[144amd64-default-job-31] |   `-- Extracting py312-charset-normalizer-3.5.1: .......... done
[144amd64-default-job-31] `-- Extracting py312-requests-2.34.2: .......... done
[144amd64-default-job-31] Extracting py312-elasticsearch-9.5.1: .......... done
===>   py312-elasticsearch-curator-5.8.4_2 depends on package: py312-elasticsearch>=7.15.1 - found
===>   Returning to build of py312-elasticsearch-curator-5.8.4_2
===>   py312-elasticsearch-curator-5.8.4_2 depends on package: py312-requests-aws4auth>=0.9 - not found
===>   Installing existing package /packages/All/py312-requests-aws4auth-1.3.2.pkg
[144amd64-default-job-31] Installing py312-requests-aws4auth-1.3.2...
[144amd64-default-job-31] Extracting py312-requests-aws4auth-1.3.2: .......... done
===>   py312-elasticsearch-curator-5.8.4_2 depends on package: py312-requests-aws4auth>=0.9 - found
===>   Returning to build of py312-elasticsearch-curator-5.8.4_2
===>   py312-elasticsearch-curator-5.8.4_2 depends on package: py312-six>=1.11.0 - found
===>   py312-elasticsearch-curator-5.8.4_2 depends on package: py312-urllib3>=1.26.4 - found
===>   py312-elasticsearch-curator-5.8.4_2 depends on package: py312-voluptuous>=0.9.3 - not found
===>   Installing existing package /packages/All/py312-voluptuous-0.16.0.pkg
[144amd64-default-job-31] Installing py312-voluptuous-0.16.0...
[144amd64-default-job-31] Extracting py312-voluptuous-0.16.0: .......... done
===>   py312-elasticsearch-curator-5.8.4_2 depends on package: py312-voluptuous>=0.9.3 - found
===>   Returning to build of py312-elasticsearch-curator-5.8.4_2
===>   py312-elasticsearch-curator-5.8.4_2 depends on package: py312-pyyaml>=3.10 - not found
===>   Installing existing package /packages/All/py312-pyyaml-6.0.3_1.pkg
[144amd64-default-job-31] Installing py312-pyyaml-6.0.3_1...
[144amd64-default-job-31] `-- Installing libyaml-0.2.5...
[144amd64-default-job-31] `-- Extracting libyaml-0.2.5: ......... done
[144amd64-default-job-31] Extracting py312-pyyaml-6.0.3_1: .......... done
===>   py312-elasticsearch-curator-5.8.4_2 depends on package: py312-pyyaml>=3.10 - found
===>   Returning to build of py312-elasticsearch-curator-5.8.4_2
===>   py312-elasticsearch-curator-5.8.4_2 depends on file: /usr/local/bin/python3.12 - found
===>   py312-elasticsearch-curator-5.8.4_2 depends on package: py312-setuptools>=63.1.0 - not found
===>   Installing existing package /packages/All/py312-setuptools-63.1.0_3.pkg
[144amd64-default-job-31] Installing py312-setuptools-63.1.0_3...
[144amd64-default-job-31] Extracting py312-setuptools-63.1.0_3: .......... done
===>   py312-elasticsearch-curator-5.8.4_2 depends on package: py312-setuptools>=63.1.0 - found
===>   Returning to build of py312-elasticsearch-curator-5.8.4_2
===>   py312-elasticsearch-curator-5.8.4_2 depends on file: /usr/local/bin/python3.12 - found
===========================================================================
=======================<phase: lib-depends    >============================
===== env: USE_PACKAGE_DEPENDS_ONLY=1 USER=root UID=0 GID=0
===========================================================================
=======================<phase: configure      >============================
===== env: NO_DEPENDS=yes USER=root UID=0 GID=0
===>  Configuring for py312-elasticsearch-curator-5.8.4_2
/usr/local/lib/python3.12/site-packages/setuptools/installer.py:27: SetuptoolsDeprecationWarning: setuptools.installer is deprecated. Requirements should be satisfied by a PEP 517 installer.
  warnings.warn(
WARNING: The wheel package is not available.
/usr/local/bin/python3.12: No module named pip
Traceback (most recent call last):
  File "setup.py", line 39, in <module>
    from cx_Freeze import setup, Executable
ModuleNotFoundError: No module named 'cx_Freeze'

During handling of the above exception, another exception occurred:

Traceback (most recent call last):
  File "/usr/local/lib/python3.12/site-packages/setuptools/installer.py", line 82, in fetch_build_egg
    subprocess.check_call(cmd)
  File "/usr/local/lib/python3.12/subprocess.py", line 413, in check_call
    raise CalledProcessError(retcode, cmd)
subprocess.CalledProcessError: Command '['/usr/local/bin/python3.12', '-m', 'pip', '--disable-pip-version-check', 'wheel', '--no-deps', '-w', '/tmp/tmppw2s8hpv', '--quiet', 'elasticsearch<8.0.0,>=7.12.0']' returned non-zero exit status 1.

The above exception was the direct cause of the following exception:

Traceback (most recent call last):
  File "<string>", line 1, in <module>
  File "setup.py", line 144, in <module>
    setup(
  File "/usr/local/lib/python3.12/site-packages/setuptools/__init__.py", line 86, in setup
    _install_setup_requires(attrs)
  File "/usr/local/lib/python3.12/site-packages/setuptools/__init__.py", line 80, in _install_setup_requires
    dist.fetch_build_eggs(dist.setup_requires)
  File "/usr/local/lib/python3.12/site-packages/setuptools/dist.py", line 875, in fetch_build_eggs
    resolved_dists = pkg_resources.working_set.resolve(
                     ^^^^^^^^^^^^^^^^^^^^^^^^^^^^^^^^^^
  File "/usr/local/lib/python3.12/site-packages/pkg_resources/__init__.py", line 789, in resolve
    dist = best[req.key] = env.best_match(
                           ^^^^^^^^^^^^^^^
  File "/usr/local/lib/python3.12/site-packages/pkg_resources/__init__.py", line 1075, in best_match
    return self.obtain(req, installer)
           ^^^^^^^^^^^^^^^^^^^^^^^^^^^
  File "/usr/local/lib/python3.12/site-packages/pkg_resources/__init__.py", line 1087, in obtain
    return installer(requirement)
           ^^^^^^^^^^^^^^^^^^^^^^
  File "/usr/local/lib/python3.12/site-packages/setuptools/dist.py", line 945, in fetch_build_egg
    return fetch_build_egg(self, req)
           ^^^^^^^^^^^^^^^^^^^^^^^^^^
  File "/usr/local/lib/python3.12/site-packages/setuptools/installer.py", line 84, in fetch_build_egg
    raise DistutilsError(str(e)) from e
distutils.errors.DistutilsError: Command '['/usr/local/bin/python3.12', '-m', 'pip', '--disable-pip-version-check', 'wheel', '--no-deps', '-w', '/tmp/tmppw2s8hpv', '--quiet', 'elasticsearch<8.0.0,>=7.12.0']' returned non-zero exit status 1.
*** Error code 1

Stop.
make: stopped making "configure" in /usr/ports/textproc/py-elasticsearch-curator

From nobody Tue Oct  6 21:28:22 2026
X-Original-To: elastic@mlmmj.nyi.freebsd.org
Received: from mx1.freebsd.org (mx1.freebsd.org [IPv6:2610:1c1:1:606c::19:1])
	by mlmmj.nyi.freebsd.org (Postfix) with ESMTP id 4hzq9z3Tjjz6cW0D
	for <elastic@mlmmj.nyi.freebsd.org>; Tue, 06 Oct 2026 21:28:23 +0000 (UTC)
	(envelope-from pkg-fallout@FreeBSD.org)
Received: from mxrelay.chi.freebsd.org (mxrelay.chi.freebsd.org [IPv6:2610:1c0:1040:6064::19:3])
	(using TLSv1.3 with cipher TLS_AES_256_GCM_SHA384 (256/256 bits)
	 key-exchange x25519 server-signature RSA-PSS (4096 bits) server-digest SHA256
	 client-signature ECDSA (prime256v1) client-digest SHA256)
	(Client CN "mxrelay.chi.freebsd.org", Issuer "YE2" (not verified))
	by mx1.freebsd.org (Postfix) with ESMTPS id 4hzq9y73WYz4kXG
	for <elastic@FreeBSD.org>; Tue, 06 Oct 2026 21:28:22 +0000 (UTC)
	(envelope-from pkg-fallout@FreeBSD.org)
ARC-Seal: i=1; a=rsa-sha256; d=freebsd.org; s=dkim; cv=none; t=1791322103;
	b=IbXvbI8JFQ6mYbCt19jecdzCkMUvC4Ze2XMB6m8JT1LTq/tUv9agfAZZRX5eXiwxFjc/gL
	7B0m/C9i27QiidKkHwVA4EMs/nQQij75jQ4KuwyWsJXDS7YvxAvlMOehGyRVOSdmztuAQQ
	WeePdhHGrxJ9xdF3On1HipBky7pqJF4kBXMQ44tBuauboIUR61dBbo9EmGXSoUUW4XBcTl
	fngRoGevCmAG9LNzELM25l3H3+bx6hMIo0AoAtTOxYUv+kGCxwqb5k2liRw5zcFijT9Cwo
	0QMt4t4czZSi3c0q2rOp2tnowH1dliy6TeGOeyJCu9lJF+n0DAzy7QlMpNpZOA==
ARC-Message-Signature: i=1; a=rsa-sha256; c=relaxed/relaxed; d=freebsd.org;
	s=dkim; t=1791322103;
	h=from:from:reply-to:subject:subject:date:date:message-id:message-id:
	 to:to:cc:cc; bh=/Yz+jtQ3ZoEg1+iJ2UBObuJFoygNkwV/cAYG3QdpRUY=;
	b=Y3MO8WzEFC9CaPoR0wSRLNStsJhpluUInzMpfbifvD2r6fLhDOJxsxvkCRiAKBfFOH0hkc
	r3cO8GQuzrxRYpy9e8c0uI3/GYD7FF9P7s96LdvOgrpeYUGqYa48MLzbersOv7fbEWLFXE
	xgCea6TlXw9AQQYnoOENcZQui2KgeTXUkrBmHJw0h9OLcRH3fDEUITU5oVB5v8TGpJQ1ld
	sfJy2bcya8XCHZdcBFUpEvYCSTGNE17BhDEx1sEv2OmQ8pNFXhfJx+GhW4NW/dF8/r1apY
	tM/W6CJPhRoBGV/xnHxouPUM2odwOkdy8wLmtyrMEHGpcmCpJKn0+DaJG386OQ==
ARC-Authentication-Results: i=1;
	mx1.freebsd.org;
	none
Received: from ampere4.chi.freebsd.org (ampere4.chi.freebsd.org [IPv6:2610:1c0:1040:6080::16:17])
	by mxrelay.chi.freebsd.org (Postfix) with ESMTP id ACAC225C7B
	for <elastic@FreeBSD.org>; Tue, 06 Oct 2026 21:28:22 +0000 (UTC)
	(envelope-from pkg-fallout@FreeBSD.org)
Received: from root (uid 0)
	(envelope-from pkg-fallout@FreeBSD.org)
	id 3b6f
	by ampere4.chi.freebsd.org (DragonFly Mail Agent v0.13+ on ampere4.chi.freebsd.org);
	Tue, 06 Oct 2026 21:28:22 +0000
To: elastic@FreeBSD.org
Subject: [package - 151arm64-quarterly][textproc/py-elasticsearch-curator] Failed for py312-elasticsearch-curator-5.8.4_2 in configure
Cc: pkg-fallout@FreeBSD.org
Date: Tue, 06 Oct 2026 21:28:22 +0000
Message-Id: <6ac567f6.3b6f.444412ee@ampere4.chi.freebsd.org>
From: <pkg-fallout@FreeBSD.org>
List-Id: Support of ElasticSearch-related ports <freebsd-elastic.freebsd.org>
List-Archive: https://lists.freebsd.org/archives/freebsd-elastic
List-Help: <mailto:freebsd-elastic+help@freebsd.org>
List-Post: <mailto:freebsd-elastic@freebsd.org>
List-Subscribe: <mailto:freebsd-elastic+subscribe@freebsd.org>
List-Unsubscribe: <mailto:freebsd-elastic+unsubscribe@freebsd.org>
Sender: owner-freebsd-elastic@FreeBSD.org
List-Id: <freebsd-elastic.FreeBSD.org>
List-Post: <mailto:freebsd-elastic@FreeBSD.org>
List-Help: <mailto:freebsd-elastic+help@FreeBSD.org>
List-Subscribe: <mailto:freebsd-elastic+subscribe@FreeBSD.org>
List-Unsubscribe: <mailto:freebsd-elastic+unsubscribe@FreeBSD.org>
List-Owner: <mailto:postmaster@FreeBSD.org>
Precedence: list

You are receiving this mail as a port that you maintain
is failing to build on the FreeBSD package build server.
Please investigate the failure and submit a PR to fix
build.

Maintainer:     elastic@FreeBSD.org
Log URL:        https://pkg-status.freebsd.org/ampere4/data/151arm64-quarterly/3a7a1297a515/logs/py312-elasticsearch-curator-5.8.4_2.log
Build URL:      https://pkg-status.freebsd.org/ampere4/build.html?mastername=151arm64-quarterly&build=3a7a1297a515
Log:

=>> Building textproc/py-elasticsearch-curator
build started at Tue Oct  6 21:28:14 UTC 2026
port directory: /usr/ports/textproc/py-elasticsearch-curator
package name: py312-elasticsearch-curator-5.8.4_2
building for: FreeBSD 151arm64-quarterly-job-07 15.1-RELEASE-p4 FreeBSD 15.1-RELEASE-p4 arm64
maintained by: elastic@FreeBSD.org
Makefile datestamp: -rw-r--r--  1 root wheel 1203 Oct  4 01:01 /usr/ports/textproc/py-elasticsearch-curator/Makefile
Ports top last git commit: 3a7a1297a515552d4aef02f06cd5ee1a92ed4583
Ports top unclean checkout: no
Port dir last git commit: 3a7a1297a515552d4aef02f06cd5ee1a92ed4583
Port dir unclean checkout: no
Poudriere version: poudriere-git-3.4.8-3-gd92fb7c0
Host OSVERSION: 1600022
Jail OSVERSION: 1501000
Job Id: 07

---Begin Environment---
SHELL=/bin/sh
OSVERSION=1501000
UNAME_v=FreeBSD 15.1-RELEASE-p4
UNAME_r=15.1-RELEASE-p4
BLOCKSIZE=K
MAIL=/var/mail/root
MM_CHARSET=UTF-8
LANG=C.UTF-8
STATUS=1
HOME=/root
PATH=/sbin:/bin:/usr/sbin:/usr/bin:/usr/local/sbin:/usr/local/bin:/root/bin
MAKE_OBJDIR_CHECK_WRITABLE=0
LOCALBASE=/usr/local
USER=root
POUDRIERE_NAME=poudriere-git
LIBEXECPREFIX=/usr/local/libexec/poudriere
POUDRIERE_VERSION=3.4.8-3-gd92fb7c0
MASTERMNT=/usr/local/poudriere/data/.m/151arm64-quarterly/ref
LC_COLLATE=C
POUDRIERE_BUILD_TYPE=bulk
PACKAGE_BUILDING=yes
SAVED_TERM=
OUTPUT_REDIRECTED_STDERR=4
OUTPUT_REDIRECTED=1
PWD=/usr/local/poudriere/data/.m/151arm64-quarterly/07/.p
OUTPUT_REDIRECTED_STDOUT=3
P_PORTS_FEATURES=FLAVORS SUBPACKAGES SELECTED_OPTIONS
MASTERNAME=151arm64-quarterly
SCRIPTPREFIX=/usr/local/share/poudriere
SCRIPTNAME=bulk.sh
OLDPWD=/usr/local/poudriere/data/.m/151arm64-quarterly/ref/.p/pool
POUDRIERE_PKGNAME=poudriere-git-3.4.8-3-gd92fb7c0
SCRIPTPATH=/usr/local/share/poudriere/bulk.sh
POUDRIEREPATH=/usr/local/bin/poudriere
---End Environment---

---Begin Poudriere Port Flags/Env---
PORT_FLAGS=
PKGENV=
FLAVOR=py312
MAKE_ARGS= FLAVOR=py312
---End Poudriere Port Flags/Env---

---Begin OPTIONS List---
---End OPTIONS List---

--MAINTAINER--
elastic@FreeBSD.org
--End MAINTAINER--

--CONFIGURE_ARGS--

--End CONFIGURE_ARGS--

--CONFIGURE_ENV--
PYTHON="/usr/local/bin/python3.12" XDG_DATA_HOME=/wrkdirs/usr/ports/textproc/py-elasticsearch-curator/work-py312  XDG_CONFIG_HOME=/wrkdirs/usr/ports/textproc/py-elasticsearch-curator/work-py312  XDG_CACHE_HOME=/wrkdirs/usr/ports/textproc/py-elasticsearch-curator/work-py312/.cache  HOME=/wrkdirs/usr/ports/textproc/py-elasticsearch-curator/work-py312 TMPDIR="/tmp" PATH=/wrkdirs/usr/ports/textproc/py-elasticsearch-curator/work-py312/.bin:/sbin:/bin:/usr/sbin:/usr/bin:/usr/local/sbin:/usr/local/bin:/root/bin PKG_CONFIG_LIBDIR=/wrkdirs/usr/ports/textproc/py-elasticsearch-curator/work-py312/.pkgconfig:/usr/local/libdata/pkgconfig:/usr/local/share/pkgconfig:/usr/libdata/pkgconfig SHELL=/bin/sh CONFIG_SHELL=/bin/sh
--End CONFIGURE_ENV--

--MAKE_ENV--
XDG_DATA_HOME=/wrkdirs/usr/ports/textproc/py-elasticsearch-curator/work-py312  XDG_CONFIG_HOME=/wrkdirs/usr/ports/textproc/py-elasticsearch-curator/work-py312  XDG_CACHE_HOME=/wrkdirs/usr/ports/textproc/py-elasticsearch-curator/work-py312/.cache  HOME=/wrkdirs/usr/ports/textproc/py-elasticsearch-curator/work-py312 TMPDIR="/tmp" PATH=/wrkdirs/usr/ports/textproc/py-elasticsearch-curator/work-py312/.bin:/sbin:/bin:/usr/sbin:/usr/bin:/usr/local/sbin:/usr/local/bin:/root/bin PKG_CONFIG_LIBDIR=/wrkdirs/usr/ports/textproc/py-elasticsearch-curator/work-py312/.pkgconfig:/usr/local/libdata/pkgconfig:/usr/local/share/pkgconfig:/usr/libdata/pkgconfig MK_DEBUG_FILES=no MK_KERNEL_SYMBOLS=no SHELL=/bin/sh NO_LINT=YES LDSHARED="cc -shared" PYTHONDONTWRITEBYTECODE= PYTHONOPTIMIZE= PREFIX=/usr/local  LOCALBASE=/usr/local  CC="cc" CFLAGS="-O2 -pipe  -fstack-protector-strong -fno-strict-aliasing "  CPP="cpp" CPPFLAGS=""  LDFLAGS=" " LIBS=""  CXX="c++" CXXFLAGS="-O2 -pipe -fstack-protector-stron
g -fno-strict-aliasing   " BSD_INSTALL_PROGRAM="install  -s -m 555"  BSD_INSTALL_LIB="install  -s -m 0644"  BSD_INSTALL_SCRIPT="install  -m 555"  BSD_INSTALL_DATA="install  -m 0644"  BSD_INSTALL_MAN="install  -m 444"
--End MAKE_ENV--

--PLIST_SUB--
PYTHON_INCLUDEDIR=include/python3.12  PYTHON_LIBDIR=lib/python3.12  PYTHON_PLATFORM=freebsd15  PYTHON_SITELIBDIR=lib/python3.12/site-packages  PYTHON_SUFFIX=312  PYTHON_BASESUFFIX=312  PYTHON_TAG=.cpython-312  PYTHON_SOABI=.cpython-312  PYTHON_VER=3.12  PYTHON_BASEVER=3.12  PYTHON_VERSION=python3.12 PYTHON2="@comment " PYTHON3="" OSREL=15.1 PREFIX=%D LOCALBASE=/usr/local  RESETPREFIX=/usr/local LIB32DIR=lib DOCSDIR="share/doc/elasticsearch-curator"  EXAMPLESDIR="share/examples/elasticsearch-curator"  DATADIR="share/elasticsearch-curator"  WWWDIR="www/elasticsearch-curator"  ETCDIR="etc/elasticsearch-curator"
--End PLIST_SUB--

--SUB_LIST--
PYTHON_INCLUDEDIR=/usr/local/include/python3.12  PYTHON_LIBDIR=/usr/local/lib/python3.12  PYTHON_PLATFORM=freebsd15  PYTHON_SITELIBDIR=/usr/local/lib/python3.12/site-packages  PYTHON_SUFFIX=312  PYTHON_BASESUFFIX=312  PYTHON_TAG=.cpython-312  PYTHON_SOABI=.cpython-312  PYTHON_VER=3.12  PYTHON_BASEVER=3.12  PYTHON_VERSION=python3.12 PYTHON2="@comment " PYTHON3="" PREFIX=/usr/local LOCALBASE=/usr/local  DATADIR=/usr/local/share/elasticsearch-curator DOCSDIR=/usr/local/share/doc/elasticsearch-curator EXAMPLESDIR=/usr/local/share/examples/elasticsearch-curator  WWWDIR=/usr/local/www/elasticsearch-curator ETCDIR=/usr/local/etc/elasticsearch-curator
--End SUB_LIST--

---Begin make.conf---
USE_PACKAGE_DEPENDS=yes
BATCH=yes
WRKDIRPREFIX=/wrkdirs
PORTSDIR=/usr/ports
PACKAGES=/packages
DISTDIR=/distfiles
PACKAGE_BUILDING=yes
PACKAGE_BUILDING_FLAVORS=yes
####  ####
# XXX: We really need this but cannot use it while 'make checksum' does not
# try the next mirror on checksum failure.  It currently retries the same
# failed mirror and then fails rather then trying another.  It *does*
# try the next if the size is mismatched though.
#MASTER_SITE_FREEBSD=yes
# Build ALLOW_MAKE_JOBS_PACKAGES with 3 jobs
MAKE_JOBS_NUMBER=3
#### Misc Poudriere ####
.include "/etc/make.conf.ports_env"
GID=0
UID=0
---End make.conf---
--Resource limits--
cpu time               (seconds, -t)  unlimited
file size           (512-blocks, -f)  unlimited
data seg size           (kbytes, -d)  1048576
stack size              (kbytes, -s)  1048576
core file size      (512-blocks, -c)  unlimited
max memory size         (kbytes, -m)  unlimited
locked memory           (kbytes, -l)  unlimited
max user processes              (-u)  89999
open files                      (-n)  8192
virtual mem size        (kbytes, -v)  unlimited
swap limit              (kbytes, -w)  unlimited
socket buffer size       (bytes, -b)  unlimited
pseudo-terminals                (-p)  unlimited
kqueues                         (-k)  unlimited
umtx shared locks               (-o)  unlimited
pipebuf                         (-y)  unlimited
--End resource limits--
=======================<phase: check-sanity   >============================
===== env: NO_DEPENDS=yes USER=root UID=0 GID=0
===>  License APACHE20 accepted by the user
===========================================================================
=======================<phase: pkg-depends    >============================
===== env: USE_PACKAGE_DEPENDS_ONLY=1 USER=root UID=0 GID=0
===>   py312-elasticsearch-curator-5.8.4_2 depends on file: /usr/local/sbin/pkg - not found
===>   Installing existing package /packages/All/pkg-2.8.4.pkg
[151arm64-quarterly-job-07] Installing pkg-2.8.4...
[151arm64-quarterly-job-07] Extracting pkg-2.8.4: .......... done
===>   py312-elasticsearch-curator-5.8.4_2 depends on file: /usr/local/sbin/pkg - found
===>   Returning to build of py312-elasticsearch-curator-5.8.4_2
===========================================================================
=======================<phase: fetch-depends  >============================
===== env: USE_PACKAGE_DEPENDS_ONLY=1 USER=root UID=0 GID=0
===========================================================================
=======================<phase: fetch          >============================
===== env: NO_DEPENDS=yes USER=root UID=0 GID=0
===>  License APACHE20 accepted by the user
===> Fetching all distfiles required by py312-elasticsearch-curator-5.8.4_2 for building
===========================================================================
=======================<phase: checksum       >============================
===== env: NO_DEPENDS=yes USER=root UID=0 GID=0
===>  License APACHE20 accepted by the user
===> Fetching all distfiles required by py312-elasticsearch-curator-5.8.4_2 for building
=> SHA256 Checksum OK for elastic-curator-v5.8.4_GH0.tar.gz.
===========================================================================
=======================<phase: extract-depends>============================
===== env: USE_PACKAGE_DEPENDS_ONLY=1 USER=root UID=0 GID=0
===========================================================================
=======================<phase: extract        >============================
===== env: NO_DEPENDS=yes USER=root UID=0 GID=0
===>  License APACHE20 accepted by the user
===> Fetching all distfiles required by py312-elasticsearch-curator-5.8.4_2 for building
===>  Extracting for py312-elasticsearch-curator-5.8.4_2
=> SHA256 Checksum OK for elastic-curator-v5.8.4_GH0.tar.gz.
===========================================================================
=======================<phase: patch-depends  >============================
===== env: USE_PACKAGE_DEPENDS_ONLY=1 USER=root UID=0 GID=0
===========================================================================
=======================<phase: patch          >============================
===== env: NO_DEPENDS=yes USER=root UID=0 GID=0
===>  Patching for py312-elasticsearch-curator-5.8.4_2
===>  Applying FreeBSD patches for py312-elasticsearch-curator-5.8.4_2 from /usr/ports/textproc/py-elasticsearch-curator/files
===========================================================================
=======================<phase: build-depends  >============================
===== env: USE_PACKAGE_DEPENDS_ONLY=1 USER=root UID=0 GID=0
===>   py312-elasticsearch-curator-5.8.4_2 depends on package: py312-boto3>=1.7.24 - not found
===>   Installing existing package /packages/All/py312-boto3-1.43.99.pkg
[151arm64-quarterly-job-07] Installing py312-boto3-1.43.99...
[151arm64-quarterly-job-07] `-- Installing py312-botocore-1.43.99...
[151arm64-quarterly-job-07] |   `-- Installing py312-jmespath-1.1.0...
[151arm64-quarterly-job-07] |   | `-- Installing python312-3.12.14_1...
[151arm64-quarterly-job-07] |   |   `-- Installing expat-2.8.4...
[151arm64-quarterly-job-07] |   |   `-- Extracting expat-2.8.4: .......... done
[151arm64-quarterly-job-07] |   |   `-- Installing gettext-runtime-1.0_1...
[151arm64-quarterly-job-07] |   |   | `-- Installing indexinfo-0.3.1_1...
[151arm64-quarterly-job-07] |   |   | `-- Extracting indexinfo-0.3.1_1: .... done
[151arm64-quarterly-job-07] |   |   `-- Extracting gettext-runtime-1.0_1: .......... done
[151arm64-quarterly-job-07] |   |   `-- Installing libffi-3.8.0...
[151arm64-quarterly-job-07] |   |   `-- Extracting libffi-3.8.0: .......... done
[151arm64-quarterly-job-07] |   |   `-- Installing mpdecimal-4.0.1...
[151arm64-quarterly-job-07] |   |   `-- Extracting mpdecimal-4.0.1: .......... done
[151arm64-quarterly-job-07] |   |   `-- Installing readline-8.3.6...
[151arm64-quarterly-job-07] |   |   `-- Extracting readline-8.3.6: .......... done
[151arm64-quarterly-job-07] |   | `-- Extracting python312-3.12.14_1: .......... done
[151arm64-quarterly-job-07] |   `-- Extracting py312-jmespath-1.1.0: .......... done
[151arm64-quarterly-job-07] |   `-- Installing py312-python-dateutil-2.9.0...
[151arm64-quarterly-job-07] |   | `-- Installing py312-six-1.17.0...
[151arm64-quarterly-job-07] |   | `-- Extracting py312-six-1.17.0: .......... done
[151arm64-quarterly-job-07] |   `-- Extracting py312-python-dateutil-2.9.0: .......... done
[151arm64-quarterly-job-07] |   `-- Installing py312-urllib3-2.8.0,1...
[151arm64-quarterly-job-07] |   | `-- Installing py312-pysocks-1.7.1_1...
[151arm64-quarterly-job-07] |   | `-- Extracting py312-pysocks-1.7.1_1: .......... done
[151arm64-quarterly-job-07] |   `-- Extracting py312-urllib3-2.8.0,1: .......... done
[151arm64-quarterly-job-07] `-- Extracting py312-botocore-1.43.99: .......... done
[151arm64-quarterly-job-07] `-- Installing py312-s3transfer-0.19.2...
[151arm64-quarterly-job-07] `-- Extracting py312-s3transfer-0.19.2: .......... done
[151arm64-quarterly-job-07] Extracting py312-boto3-1.43.99: .......... done
=====
Message from python312-3.12.14_1:

--
Note that some standard Python modules are provided as separate ports
as they require additional dependencies. They are available as:

py312-gdbm       databases/py-gdbm@py312
py312-sqlite3    databases/py-sqlite3@py312
py312-tkinter    x11-toolkits/py-tkinter@py312
=====
Message from py312-urllib3-2.8.0,1:

--
Since version 1.25 HTTPS connections are now verified by default which is done
via "cert_reqs = 'CERT_REQUIRED'".  While certificate verification can be
disabled via "cert_reqs = 'CERT_NONE'", it's highly recommended to leave it on.

Various consumers of net/py-urllib3 already have implemented routines that
either explicitly enable or disable HTTPS certificate verification (e.g. via
configuration settings, CLI arguments, etc.).

Yet it may happen that there are still some consumers which don't explicitly
enable/disable certificate verification for HTTPS connections which could then
lead to errors (as is often the case with self-signed certificates).

In case of an error one should try first to temporarily disable certificate
verification of the problematic urllib3 consumer to see if that approach will
remedy the issue.
===>   py312-elasticsearch-curator-5.8.4_2 depends on package: py312-boto3>=1.7.24 - found
===>   Returning to build of py312-elasticsearch-curator-5.8.4_2
===>   py312-elasticsearch-curator-5.8.4_2 depends on package: py312-certifi>=2018.10.15 - not found
===>   Installing existing package /packages/All/py312-certifi-2026.7.22.pkg
[151arm64-quarterly-job-07] Installing py312-certifi-2026.7.22...
[151arm64-quarterly-job-07] Extracting py312-certifi-2026.7.22: .......... done
===>   py312-elasticsearch-curator-5.8.4_2 depends on package: py312-certifi>=2018.10.15 - found
===>   Returning to build of py312-elasticsearch-curator-5.8.4_2
===>   py312-elasticsearch-curator-5.8.4_2 depends on package: py312-click7>=7.1.2 - not found
===>   Installing existing package /packages/All/py312-click7-7.1.2_1.pkg
[151arm64-quarterly-job-07] Installing py312-click7-7.1.2_1...
[151arm64-quarterly-job-07] Extracting py312-click7-7.1.2_1: .......... done
===>   py312-elasticsearch-curator-5.8.4_2 depends on package: py312-click7>=7.1.2 - found
===>   Returning to build of py312-elasticsearch-curator-5.8.4_2
===>   py312-elasticsearch-curator-5.8.4_2 depends on package: py312-elasticsearch>=7.15.1 - not found
===>   Installing existing package /packages/All/py312-elasticsearch-9.5.1.pkg
[151arm64-quarterly-job-07] Installing py312-elasticsearch-9.5.1...
[151arm64-quarterly-job-07] `-- Installing py312-anyio-4.15.1...
[151arm64-quarterly-job-07] |   `-- Installing py312-idna-3.20...
[151arm64-quarterly-job-07] |   `-- Extracting py312-idna-3.20: .......... done
[151arm64-quarterly-job-07] |   `-- Installing py312-truststore-0.10.4_1...
[151arm64-quarterly-job-07] |   `-- Extracting py312-truststore-0.10.4_1: .......... done
[151arm64-quarterly-job-07] |   `-- Installing py312-typing-extensions-4.16.0...
[151arm64-quarterly-job-07] |   `-- Extracting py312-typing-extensions-4.16.0: .......... done
[151arm64-quarterly-job-07] `-- Extracting py312-anyio-4.15.1: .......... done
[151arm64-quarterly-job-07] `-- Installing py312-elastic-transport-9.4.2...
[151arm64-quarterly-job-07] |   `-- Installing py312-sniffio-1.3.1...
[151arm64-quarterly-job-07] |   `-- Extracting py312-sniffio-1.3.1: .......... done
[151arm64-quarterly-job-07] `-- Extracting py312-elastic-transport-9.4.2: .......... done
[151arm64-quarterly-job-07] `-- Installing py312-requests-2.34.2...
[151arm64-quarterly-job-07] |   `-- Installing py312-charset-normalizer-3.5.1...
[151arm64-quarterly-job-07] |   `-- Extracting py312-charset-normalizer-3.5.1: .......... done
[151arm64-quarterly-job-07] `-- Extracting py312-requests-2.34.2: .......... done
[151arm64-quarterly-job-07] Extracting py312-elasticsearch-9.5.1: .......... done
===>   py312-elasticsearch-curator-5.8.4_2 depends on package: py312-elasticsearch>=7.15.1 - found
===>   Returning to build of py312-elasticsearch-curator-5.8.4_2
===>   py312-elasticsearch-curator-5.8.4_2 depends on package: py312-requests-aws4auth>=0.9 - not found
===>   Installing existing package /packages/All/py312-requests-aws4auth-1.3.2.pkg
[151arm64-quarterly-job-07] Installing py312-requests-aws4auth-1.3.2...
[151arm64-quarterly-job-07] Extracting py312-requests-aws4auth-1.3.2: .......... done
===>   py312-elasticsearch-curator-5.8.4_2 depends on package: py312-requests-aws4auth>=0.9 - found
===>   Returning to build of py312-elasticsearch-curator-5.8.4_2
===>   py312-elasticsearch-curator-5.8.4_2 depends on package: py312-six>=1.11.0 - found
===>   py312-elasticsearch-curator-5.8.4_2 depends on package: py312-urllib3>=1.26.4 - found
===>   py312-elasticsearch-curator-5.8.4_2 depends on package: py312-voluptuous>=0.9.3 - not found
===>   Installing existing package /packages/All/py312-voluptuous-0.16.0.pkg
[151arm64-quarterly-job-07] Installing py312-voluptuous-0.16.0...
[151arm64-quarterly-job-07] Extracting py312-voluptuous-0.16.0: .......... done
===>   py312-elasticsearch-curator-5.8.4_2 depends on package: py312-voluptuous>=0.9.3 - found
===>   Returning to build of py312-elasticsearch-curator-5.8.4_2
===>   py312-elasticsearch-curator-5.8.4_2 depends on package: py312-pyyaml>=3.10 - not found
===>   Installing existing package /packages/All/py312-pyyaml-6.0.3_1.pkg
[151arm64-quarterly-job-07] Installing py312-pyyaml-6.0.3_1...
[151arm64-quarterly-job-07] `-- Installing libyaml-0.2.5...
[151arm64-quarterly-job-07] `-- Extracting libyaml-0.2.5: ......... done
[151arm64-quarterly-job-07] Extracting py312-pyyaml-6.0.3_1: .......... done
===>   py312-elasticsearch-curator-5.8.4_2 depends on package: py312-pyyaml>=3.10 - found
===>   Returning to build of py312-elasticsearch-curator-5.8.4_2
===>   py312-elasticsearch-curator-5.8.4_2 depends on file: /usr/local/bin/python3.12 - found
===>   py312-elasticsearch-curator-5.8.4_2 depends on package: py312-setuptools>=63.1.0 - not found
===>   Installing existing package /packages/All/py312-setuptools-63.1.0_3.pkg
[151arm64-quarterly-job-07] Installing py312-setuptools-63.1.0_3...
[151arm64-quarterly-job-07] Extracting py312-setuptools-63.1.0_3: .......... done
===>   py312-elasticsearch-curator-5.8.4_2 depends on package: py312-setuptools>=63.1.0 - found
===>   Returning to build of py312-elasticsearch-curator-5.8.4_2
===>   py312-elasticsearch-curator-5.8.4_2 depends on file: /usr/local/bin/python3.12 - found
===========================================================================
=======================<phase: lib-depends    >============================
===== env: USE_PACKAGE_DEPENDS_ONLY=1 USER=root UID=0 GID=0
===========================================================================
=======================<phase: configure      >============================
===== env: NO_DEPENDS=yes USER=root UID=0 GID=0
===>  Configuring for py312-elasticsearch-curator-5.8.4_2
/usr/local/lib/python3.12/site-packages/setuptools/installer.py:27: SetuptoolsDeprecationWarning: setuptools.installer is deprecated. Requirements should be satisfied by a PEP 517 installer.
  warnings.warn(
WARNING: The wheel package is not available.
/usr/local/bin/python3.12: No module named pip
Traceback (most recent call last):
  File "setup.py", line 39, in <module>
    from cx_Freeze import setup, Executable
ModuleNotFoundError: No module named 'cx_Freeze'

During handling of the above exception, another exception occurred:

Traceback (most recent call last):
  File "/usr/local/lib/python3.12/site-packages/setuptools/installer.py", line 82, in fetch_build_egg
    subprocess.check_call(cmd)
  File "/usr/local/lib/python3.12/subprocess.py", line 413, in check_call
    raise CalledProcessError(retcode, cmd)
subprocess.CalledProcessError: Command '['/usr/local/bin/python3.12', '-m', 'pip', '--disable-pip-version-check', 'wheel', '--no-deps', '-w', '/tmp/tmpcxh16avf', '--quiet', 'elasticsearch<8.0.0,>=7.12.0']' returned non-zero exit status 1.

The above exception was the direct cause of the following exception:

Traceback (most recent call last):
  File "<string>", line 1, in <module>
  File "setup.py", line 144, in <module>
    setup(
  File "/usr/local/lib/python3.12/site-packages/setuptools/__init__.py", line 86, in setup
    _install_setup_requires(attrs)
  File "/usr/local/lib/python3.12/site-packages/setuptools/__init__.py", line 80, in _install_setup_requires
    dist.fetch_build_eggs(dist.setup_requires)
  File "/usr/local/lib/python3.12/site-packages/setuptools/dist.py", line 875, in fetch_build_eggs
    resolved_dists = pkg_resources.working_set.resolve(
                     ^^^^^^^^^^^^^^^^^^^^^^^^^^^^^^^^^^
  File "/usr/local/lib/python3.12/site-packages/pkg_resources/__init__.py", line 789, in resolve
    dist = best[req.key] = env.best_match(
                           ^^^^^^^^^^^^^^^
  File "/usr/local/lib/python3.12/site-packages/pkg_resources/__init__.py", line 1075, in best_match
    return self.obtain(req, installer)
           ^^^^^^^^^^^^^^^^^^^^^^^^^^^
  File "/usr/local/lib/python3.12/site-packages/pkg_resources/__init__.py", line 1087, in obtain
    return installer(requirement)
           ^^^^^^^^^^^^^^^^^^^^^^
  File "/usr/local/lib/python3.12/site-packages/setuptools/dist.py", line 945, in fetch_build_egg
    return fetch_build_egg(self, req)
           ^^^^^^^^^^^^^^^^^^^^^^^^^^
  File "/usr/local/lib/python3.12/site-packages/setuptools/installer.py", line 84, in fetch_build_egg
    raise DistutilsError(str(e)) from e
distutils.errors.DistutilsError: Command '['/usr/local/bin/python3.12', '-m', 'pip', '--disable-pip-version-check', 'wheel', '--no-deps', '-w', '/tmp/tmpcxh16avf', '--quiet', 'elasticsearch<8.0.0,>=7.12.0']' returned non-zero exit status 1.
*** Error code 1

Stop.
make: stopped making "configure" in /usr/ports/textproc/py-elasticsearch-curator

From nobody Tue Oct  6 21:29:24 2026
X-Original-To: elastic@mlmmj.nyi.freebsd.org
Received: from mx1.freebsd.org (mx1.freebsd.org [IPv6:2610:1c1:1:606c::19:1])
	by mlmmj.nyi.freebsd.org (Postfix) with ESMTP id 4hzqC90cGfz6cVws
	for <elastic@mlmmj.nyi.freebsd.org>; Tue, 06 Oct 2026 21:29:25 +0000 (UTC)
	(envelope-from pkg-fallout@FreeBSD.org)
Received: from mxrelay.chi.freebsd.org (mxrelay.chi.freebsd.org [IPv6:2610:1c0:1040:6064::19:3])
	(using TLSv1.3 with cipher TLS_AES_256_GCM_SHA384 (256/256 bits)
	 key-exchange x25519 server-signature RSA-PSS (4096 bits) server-digest SHA256
	 client-signature ECDSA (prime256v1) client-digest SHA256)
	(Client CN "mxrelay.chi.freebsd.org", Issuer "YE2" (not verified))
	by mx1.freebsd.org (Postfix) with ESMTPS id 4hzqC85jZrz4klB
	for <elastic@FreeBSD.org>; Tue, 06 Oct 2026 21:29:24 +0000 (UTC)
	(envelope-from pkg-fallout@FreeBSD.org)
ARC-Seal: i=1; a=rsa-sha256; d=freebsd.org; s=dkim; cv=none; t=1791322164;
	b=YcQMO4iVeuPN1QThJe86I4XaCHSK12bWFiD3X+P/lDObuWevjahRlrTGe99Md5YkHQcNbs
	LwCadxPiDXZaskb8Yd2vN8SPaJIyA6VX2bFqgZr0YPoO2TNhQXSFbV+6PM1kIOFWXLFGL2
	hzjAwkV6HLLsEbwrh7kENDMMT5ubYIesxK0hnERKi2aJI5Prvff91ZgKVxD8Ai8S9QHo3J
	hgGrXoboHj/jS0XMtN+5h0zE4IGzTxp2rOi54A8WJR3tHQrDQVNmlVF2LVQyuBGSlMmLoU
	ic7Sx07Adt5LaVALm/Shq86zFkwkwv/ZL32YO0G8ss9TuFxh7zGbvG9clqu7hQ==
ARC-Message-Signature: i=1; a=rsa-sha256; c=relaxed/relaxed; d=freebsd.org;
	s=dkim; t=1791322164;
	h=from:from:reply-to:subject:subject:date:date:message-id:message-id:
	 to:to:cc:cc; bh=DFi1BX+hf5U27rIk6ZdvEp3ZurHvjb7z3G6Cw3KkKRw=;
	b=wfs9LQMBya0y9Sa0BmDIbsQVrabO5rXj/1GCkO55dOfEiNIIx2DzXloJfijxFhYCjrCUBn
	jcd42bon97GgvaLomvHVPXFezgzQbrm9L/etuSRaXp0GY/MuaA1rmkdlK9UNNBNuBfCWCg
	AfVI0R4J3uEkbIhmNngorfYRyRc52mDzXkFJaXx5ViFupbdYvFxwTftUFKwTUN/eclWeFP
	JMaj6Vmiw2u44ZIblEJb4+kxLfOd//PkMnD88Blk+fsldK3P9OXwy6QvoOkrp6iUWbL5Bb
	iEB4b6xOsSdRnvHGcv9nagCdoCziY+IP9D97MRvLq37hBfM7V3fDEBDNtdon+w==
ARC-Authentication-Results: i=1;
	mx1.freebsd.org;
	none
Received: from beefy24.chi.freebsd.org (beefy24.chi.freebsd.org [IPv6:2610:1c0:1040:6080::16:1a])
	by mxrelay.chi.freebsd.org (Postfix) with ESMTP id 8159526243
	for <elastic@FreeBSD.org>; Tue, 06 Oct 2026 21:29:24 +0000 (UTC)
	(envelope-from pkg-fallout@FreeBSD.org)
Received: from root (uid 0)
	(envelope-from pkg-fallout@FreeBSD.org)
	id 4716
	by beefy24.chi.freebsd.org (DragonFly Mail Agent v0.13+ on beefy24.chi.freebsd.org);
	Tue, 06 Oct 2026 21:29:24 +0000
To: elastic@FreeBSD.org
Subject: [package - main-amd64-default][textproc/py-elasticsearch-curator] Failed for py312-elasticsearch-curator-5.8.4_2 in configure
Cc: pkg-fallout@FreeBSD.org
Date: Tue, 06 Oct 2026 21:29:24 +0000
Message-Id: <6ac56834.4716.41cd44c8@beefy24.chi.freebsd.org>
From: <pkg-fallout@FreeBSD.org>
List-Id: Support of ElasticSearch-related ports <freebsd-elastic.freebsd.org>
List-Archive: https://lists.freebsd.org/archives/freebsd-elastic
List-Help: <mailto:freebsd-elastic+help@freebsd.org>
List-Post: <mailto:freebsd-elastic@freebsd.org>
List-Subscribe: <mailto:freebsd-elastic+subscribe@freebsd.org>
List-Unsubscribe: <mailto:freebsd-elastic+unsubscribe@freebsd.org>
Sender: owner-freebsd-elastic@FreeBSD.org
List-Id: <freebsd-elastic.FreeBSD.org>
List-Post: <mailto:freebsd-elastic@FreeBSD.org>
List-Help: <mailto:freebsd-elastic+help@FreeBSD.org>
List-Subscribe: <mailto:freebsd-elastic+subscribe@FreeBSD.org>
List-Unsubscribe: <mailto:freebsd-elastic+unsubscribe@FreeBSD.org>
List-Owner: <mailto:postmaster@FreeBSD.org>
Precedence: list

You are receiving this mail as a port that you maintain
is failing to build on the FreeBSD package build server.
Please investigate the failure and submit a PR to fix
build.

Maintainer:     elastic@FreeBSD.org
Log URL:        https://pkg-status.freebsd.org/beefy24/data/main-amd64-default/p0b23c55e5d2c_s1e595e959f/logs/py312-elasticsearch-curator-5.8.4_2.log
Build URL:      https://pkg-status.freebsd.org/beefy24/build.html?mastername=main-amd64-default&build=p0b23c55e5d2c_s1e595e959f
Log:

=>> Building textproc/py-elasticsearch-curator
build started at Tue Oct  6 21:29:20 UTC 2026
port directory: /usr/ports/textproc/py-elasticsearch-curator
package name: py312-elasticsearch-curator-5.8.4_2
building for: FreeBSD main-amd64-default-job-12 16.0-CURRENT FreeBSD 16.0-CURRENT 1600027 amd64
maintained by: elastic@FreeBSD.org
Makefile datestamp: -rw-r--r--  1 root wheel 1203 Sep 30  2025 /usr/ports/textproc/py-elasticsearch-curator/Makefile
Ports top last git commit: 0b23c55e5d2cdcb4a5d8d11bfc2f9c56cc6348ab
Ports top unclean checkout: no
Port dir last git commit: b64b73fd938d5b2788547d16ed6a76493acc9142
Port dir unclean checkout: no
Poudriere version: poudriere-git-3.4.8-3-gd92fb7c0
Host OSVERSION: 1600022
Jail OSVERSION: 1600027
Job Id: 12




!!! Jail is newer than host. (Jail: 1600027, Host: 1600022) !!!
!!! This is not supported. !!!
!!! Host kernel must be same or newer than jail. !!!
!!! Expect build failures. !!!



---Begin Environment---
SHELL=/bin/sh
OSVERSION=1600027
UNAME_v=FreeBSD 16.0-CURRENT 1600027
UNAME_r=16.0-CURRENT
BLOCKSIZE=K
MAIL=/var/mail/root
MM_CHARSET=UTF-8
LANG=C.UTF-8
STATUS=1
HOME=/root
PATH=/sbin:/bin:/usr/sbin:/usr/bin:/usr/local/sbin:/usr/local/bin:/root/bin
MAKE_OBJDIR_CHECK_WRITABLE=0
LOCALBASE=/usr/local
USER=root
POUDRIERE_NAME=poudriere-git
LIBEXECPREFIX=/usr/local/libexec/poudriere
POUDRIERE_VERSION=3.4.8-3-gd92fb7c0
MASTERMNT=/usr/local/poudriere/data/.m/main-amd64-default/ref
LC_COLLATE=C
POUDRIERE_BUILD_TYPE=bulk
PACKAGE_BUILDING=yes
SAVED_TERM=
OUTPUT_REDIRECTED_STDERR=4
OUTPUT_REDIRECTED=1
PWD=/usr/local/poudriere/data/.m/main-amd64-default/12/.p
OUTPUT_REDIRECTED_STDOUT=3
P_PORTS_FEATURES=FLAVORS SUBPACKAGES SELECTED_OPTIONS
MASTERNAME=main-amd64-default
SCRIPTPREFIX=/usr/local/share/poudriere
SCRIPTNAME=bulk.sh
OLDPWD=/usr/local/poudriere/data/.m/main-amd64-default/ref/.p/pool
POUDRIERE_PKGNAME=poudriere-git-3.4.8-3-gd92fb7c0
SCRIPTPATH=/usr/local/share/poudriere/bulk.sh
POUDRIEREPATH=/usr/local/bin/poudriere
---End Environment---

---Begin Poudriere Port Flags/Env---
PORT_FLAGS=
PKGENV=
FLAVOR=py312
MAKE_ARGS= FLAVOR=py312
---End Poudriere Port Flags/Env---

---Begin OPTIONS List---
---End OPTIONS List---

--MAINTAINER--
elastic@FreeBSD.org
--End MAINTAINER--

--CONFIGURE_ARGS--

--End CONFIGURE_ARGS--

--CONFIGURE_ENV--
PYTHON="/usr/local/bin/python3.12" XDG_DATA_HOME=/wrkdirs/usr/ports/textproc/py-elasticsearch-curator/work-py312  XDG_CONFIG_HOME=/wrkdirs/usr/ports/textproc/py-elasticsearch-curator/work-py312  XDG_CACHE_HOME=/wrkdirs/usr/ports/textproc/py-elasticsearch-curator/work-py312/.cache  HOME=/wrkdirs/usr/ports/textproc/py-elasticsearch-curator/work-py312 TMPDIR="/tmp" PATH=/wrkdirs/usr/ports/textproc/py-elasticsearch-curator/work-py312/.bin:/sbin:/bin:/usr/sbin:/usr/bin:/usr/local/sbin:/usr/local/bin:/root/bin PKG_CONFIG_LIBDIR=/wrkdirs/usr/ports/textproc/py-elasticsearch-curator/work-py312/.pkgconfig:/usr/local/libdata/pkgconfig:/usr/local/share/pkgconfig:/usr/libdata/pkgconfig SHELL=/bin/sh CONFIG_SHELL=/bin/sh
--End CONFIGURE_ENV--

--MAKE_ENV--
XDG_DATA_HOME=/wrkdirs/usr/ports/textproc/py-elasticsearch-curator/work-py312  XDG_CONFIG_HOME=/wrkdirs/usr/ports/textproc/py-elasticsearch-curator/work-py312  XDG_CACHE_HOME=/wrkdirs/usr/ports/textproc/py-elasticsearch-curator/work-py312/.cache  HOME=/wrkdirs/usr/ports/textproc/py-elasticsearch-curator/work-py312 TMPDIR="/tmp" PATH=/wrkdirs/usr/ports/textproc/py-elasticsearch-curator/work-py312/.bin:/sbin:/bin:/usr/sbin:/usr/bin:/usr/local/sbin:/usr/local/bin:/root/bin PKG_CONFIG_LIBDIR=/wrkdirs/usr/ports/textproc/py-elasticsearch-curator/work-py312/.pkgconfig:/usr/local/libdata/pkgconfig:/usr/local/share/pkgconfig:/usr/libdata/pkgconfig MK_DEBUG_FILES=no MK_KERNEL_SYMBOLS=no SHELL=/bin/sh NO_LINT=YES LDSHARED="cc -shared" PYTHONDONTWRITEBYTECODE= PYTHONOPTIMIZE= PREFIX=/usr/local  LOCALBASE=/usr/local  CC="cc" CFLAGS="-O2 -pipe  -fstack-protector-strong -fno-strict-aliasing "  CPP="cpp" CPPFLAGS=""  LDFLAGS=" " LIBS=""  CXX="c++" CXXFLAGS="-O2 -pipe -fstack-protector-stron
g -fno-strict-aliasing   " BSD_INSTALL_PROGRAM="install  -s -m 555"  BSD_INSTALL_LIB="install  -s -m 0644"  BSD_INSTALL_SCRIPT="install  -m 555"  BSD_INSTALL_DATA="install  -m 0644"  BSD_INSTALL_MAN="install  -m 444"
--End MAKE_ENV--

--PLIST_SUB--
PYTHON_INCLUDEDIR=include/python3.12  PYTHON_LIBDIR=lib/python3.12  PYTHON_PLATFORM=freebsd16  PYTHON_SITELIBDIR=lib/python3.12/site-packages  PYTHON_SUFFIX=312  PYTHON_BASESUFFIX=312  PYTHON_TAG=.cpython-312  PYTHON_SOABI=.cpython-312  PYTHON_VER=3.12  PYTHON_BASEVER=3.12  PYTHON_VERSION=python3.12 PYTHON2="@comment " PYTHON3="" OSREL=16.0 PREFIX=%D LOCALBASE=/usr/local  RESETPREFIX=/usr/local LIB32DIR=lib DOCSDIR="share/doc/elasticsearch-curator"  EXAMPLESDIR="share/examples/elasticsearch-curator"  DATADIR="share/elasticsearch-curator"  WWWDIR="www/elasticsearch-curator"  ETCDIR="etc/elasticsearch-curator"
--End PLIST_SUB--

--SUB_LIST--
PYTHON_INCLUDEDIR=/usr/local/include/python3.12  PYTHON_LIBDIR=/usr/local/lib/python3.12  PYTHON_PLATFORM=freebsd16  PYTHON_SITELIBDIR=/usr/local/lib/python3.12/site-packages  PYTHON_SUFFIX=312  PYTHON_BASESUFFIX=312  PYTHON_TAG=.cpython-312  PYTHON_SOABI=.cpython-312  PYTHON_VER=3.12  PYTHON_BASEVER=3.12  PYTHON_VERSION=python3.12 PYTHON2="@comment " PYTHON3="" PREFIX=/usr/local LOCALBASE=/usr/local  DATADIR=/usr/local/share/elasticsearch-curator DOCSDIR=/usr/local/share/doc/elasticsearch-curator EXAMPLESDIR=/usr/local/share/examples/elasticsearch-curator  WWWDIR=/usr/local/www/elasticsearch-curator ETCDIR=/usr/local/etc/elasticsearch-curator
--End SUB_LIST--

---Begin make.conf---
USE_PACKAGE_DEPENDS=yes
BATCH=yes
WRKDIRPREFIX=/wrkdirs
PORTSDIR=/usr/ports
PACKAGES=/packages
DISTDIR=/distfiles
PACKAGE_BUILDING=yes
PACKAGE_BUILDING_FLAVORS=yes
####  ####
# XXX: We really need this but cannot use it while 'make checksum' does not
# try the next mirror on checksum failure.  It currently retries the same
# failed mirror and then fails rather then trying another.  It *does*
# try the next if the size is mismatched though.
#MASTER_SITE_FREEBSD=yes
# Build ALLOW_MAKE_JOBS_PACKAGES with 3 jobs
MAKE_JOBS_NUMBER=3
#### Misc Poudriere ####
.include "/etc/make.conf.ports_env"
GID=0
UID=0
---End make.conf---
--Resource limits--
cpu time               (seconds, -t)  unlimited
file size           (512-blocks, -f)  unlimited
data seg size           (kbytes, -d)  33554432
stack size              (kbytes, -s)  524288
core file size      (512-blocks, -c)  unlimited
max memory size         (kbytes, -m)  unlimited
locked memory           (kbytes, -l)  unlimited
max user processes              (-u)  89999
open files                      (-n)  8192
virtual mem size        (kbytes, -v)  unlimited
swap limit              (kbytes, -w)  unlimited
socket buffer size       (bytes, -b)  unlimited
pseudo-terminals                (-p)  unlimited
kqueues                         (-k)  unlimited
umtx shared locks               (-o)  unlimited
pipebuf                 (kbytes, -y)  unlimited
virtual machines                (-V)  unlimited
--End resource limits--
=======================<phase: check-sanity   >============================
===== env: NO_DEPENDS=yes USER=root UID=0 GID=0
===>  License APACHE20 accepted by the user
===========================================================================
=======================<phase: pkg-depends    >============================
===== env: USE_PACKAGE_DEPENDS_ONLY=1 USER=root UID=0 GID=0
===>   py312-elasticsearch-curator-5.8.4_2 depends on file: /usr/local/sbin/pkg - not found
===>   Installing existing package /packages/All/pkg-2.8.4.pkg
[main-amd64-default-job-12] Installing pkg-2.8.4...
[main-amd64-default-job-12] Extracting pkg-2.8.4: .......... done
===>   py312-elasticsearch-curator-5.8.4_2 depends on file: /usr/local/sbin/pkg - found
===>   Returning to build of py312-elasticsearch-curator-5.8.4_2
===========================================================================
=======================<phase: fetch-depends  >============================
===== env: USE_PACKAGE_DEPENDS_ONLY=1 USER=root UID=0 GID=0
===========================================================================
=======================<phase: fetch          >============================
===== env: NO_DEPENDS=yes USER=root UID=0 GID=0
===>  License APACHE20 accepted by the user
===> Fetching all distfiles required by py312-elasticsearch-curator-5.8.4_2 for building
===========================================================================
=======================<phase: checksum       >============================
===== env: NO_DEPENDS=yes USER=root UID=0 GID=0
===>  License APACHE20 accepted by the user
===> Fetching all distfiles required by py312-elasticsearch-curator-5.8.4_2 for building
=> SHA256 Checksum OK for elastic-curator-v5.8.4_GH0.tar.gz.
===========================================================================
=======================<phase: extract-depends>============================
===== env: USE_PACKAGE_DEPENDS_ONLY=1 USER=root UID=0 GID=0
===========================================================================
=======================<phase: extract        >============================
===== env: NO_DEPENDS=yes USER=root UID=0 GID=0
===>  License APACHE20 accepted by the user
===> Fetching all distfiles required by py312-elasticsearch-curator-5.8.4_2 for building
===>  Extracting for py312-elasticsearch-curator-5.8.4_2
=> SHA256 Checksum OK for elastic-curator-v5.8.4_GH0.tar.gz.
===========================================================================
=======================<phase: patch-depends  >============================
===== env: USE_PACKAGE_DEPENDS_ONLY=1 USER=root UID=0 GID=0
===========================================================================
=======================<phase: patch          >============================
===== env: NO_DEPENDS=yes USER=root UID=0 GID=0
===>  Patching for py312-elasticsearch-curator-5.8.4_2
===>  Applying FreeBSD patches for py312-elasticsearch-curator-5.8.4_2 from /usr/ports/textproc/py-elasticsearch-curator/files
===========================================================================
=======================<phase: build-depends  >============================
===== env: USE_PACKAGE_DEPENDS_ONLY=1 USER=root UID=0 GID=0
===>   py312-elasticsearch-curator-5.8.4_2 depends on package: py312-boto3>=1.7.24 - not found
===>   Installing existing package /packages/All/py312-boto3-1.43.99.pkg
[main-amd64-default-job-12] Installing py312-boto3-1.43.99...
[main-amd64-default-job-12] `-- Installing py312-botocore-1.43.99...
[main-amd64-default-job-12] |   `-- Installing py312-jmespath-1.1.0...
[main-amd64-default-job-12] |   | `-- Installing python312-3.12.14_1...
[main-amd64-default-job-12] |   |   `-- Installing expat-2.8.5...
[main-amd64-default-job-12] |   |   `-- Extracting expat-2.8.5: .......... done
[main-amd64-default-job-12] |   |   `-- Installing gettext-runtime-1.0_1...
[main-amd64-default-job-12] |   |   | `-- Installing indexinfo-0.3.1_1...
[main-amd64-default-job-12] |   |   | `-- Extracting indexinfo-0.3.1_1: .... done
[main-amd64-default-job-12] |   |   `-- Extracting gettext-runtime-1.0_1: .......... done
[main-amd64-default-job-12] |   |   `-- Installing libffi-3.8.0...
[main-amd64-default-job-12] |   |   `-- Extracting libffi-3.8.0: .......... done
[main-amd64-default-job-12] |   |   `-- Installing mpdecimal-4.0.1...
[main-amd64-default-job-12] |   |   `-- Extracting mpdecimal-4.0.1: .......... done
[main-amd64-default-job-12] |   |   `-- Installing readline-8.3.6...
[main-amd64-default-job-12] |   |   `-- Extracting readline-8.3.6: .......... done
[main-amd64-default-job-12] |   | `-- Extracting python312-3.12.14_1: .......... done
[main-amd64-default-job-12] |   `-- Extracting py312-jmespath-1.1.0: .......... done
[main-amd64-default-job-12] |   `-- Installing py312-python-dateutil-2.9.0...
[main-amd64-default-job-12] |   | `-- Installing py312-six-1.17.0...
[main-amd64-default-job-12] |   | `-- Extracting py312-six-1.17.0: .......... done
[main-amd64-default-job-12] |   `-- Extracting py312-python-dateutil-2.9.0: .......... done
[main-amd64-default-job-12] |   `-- Installing py312-urllib3-2.8.0,1...
[main-amd64-default-job-12] |   | `-- Installing py312-pysocks-1.7.1_1...
[main-amd64-default-job-12] |   | `-- Extracting py312-pysocks-1.7.1_1: .......... done
[main-amd64-default-job-12] |   `-- Extracting py312-urllib3-2.8.0,1: .......... done
[main-amd64-default-job-12] `-- Extracting py312-botocore-1.43.99: .......... done
[main-amd64-default-job-12] `-- Installing py312-s3transfer-0.19.2...
[main-amd64-default-job-12] `-- Extracting py312-s3transfer-0.19.2: .......... done
[main-amd64-default-job-12] Extracting py312-boto3-1.43.99: .......... done
=====
Message from python312-3.12.14_1:

--
Note that some standard Python modules are provided as separate ports
as they require additional dependencies. They are available as:

py312-gdbm       databases/py-gdbm@py312
py312-sqlite3    databases/py-sqlite3@py312
py312-tkinter    x11-toolkits/py-tkinter@py312
=====
Message from py312-urllib3-2.8.0,1:

--
Since version 1.25 HTTPS connections are now verified by default which is done
via "cert_reqs = 'CERT_REQUIRED'".  While certificate verification can be
disabled via "cert_reqs = 'CERT_NONE'", it's highly recommended to leave it on.

Various consumers of net/py-urllib3 already have implemented routines that
either explicitly enable or disable HTTPS certificate verification (e.g. via
configuration settings, CLI arguments, etc.).

Yet it may happen that there are still some consumers which don't explicitly
enable/disable certificate verification for HTTPS connections which could then
lead to errors (as is often the case with self-signed certificates).

In case of an error one should try first to temporarily disable certificate
verification of the problematic urllib3 consumer to see if that approach will
remedy the issue.
===>   py312-elasticsearch-curator-5.8.4_2 depends on package: py312-boto3>=1.7.24 - found
===>   Returning to build of py312-elasticsearch-curator-5.8.4_2
===>   py312-elasticsearch-curator-5.8.4_2 depends on package: py312-certifi>=2018.10.15 - not found
===>   Installing existing package /packages/All/py312-certifi-2026.7.22.pkg
[main-amd64-default-job-12] Installing py312-certifi-2026.7.22...
[main-amd64-default-job-12] Extracting py312-certifi-2026.7.22: .......... done
===>   py312-elasticsearch-curator-5.8.4_2 depends on package: py312-certifi>=2018.10.15 - found
===>   Returning to build of py312-elasticsearch-curator-5.8.4_2
===>   py312-elasticsearch-curator-5.8.4_2 depends on package: py312-click7>=7.1.2 - not found
===>   Installing existing package /packages/All/py312-click7-7.1.2_1.pkg
[main-amd64-default-job-12] Installing py312-click7-7.1.2_1...
[main-amd64-default-job-12] Extracting py312-click7-7.1.2_1: .......... done
===>   py312-elasticsearch-curator-5.8.4_2 depends on package: py312-click7>=7.1.2 - found
===>   Returning to build of py312-elasticsearch-curator-5.8.4_2
===>   py312-elasticsearch-curator-5.8.4_2 depends on package: py312-elasticsearch>=7.15.1 - not found
===>   Installing existing package /packages/All/py312-elasticsearch-9.5.1.pkg
[main-amd64-default-job-12] Installing py312-elasticsearch-9.5.1...
[main-amd64-default-job-12] `-- Installing py312-anyio-4.15.1...
[main-amd64-default-job-12] |   `-- Installing py312-idna-3.20...
[main-amd64-default-job-12] |   `-- Extracting py312-idna-3.20: .......... done
[main-amd64-default-job-12] |   `-- Installing py312-truststore-0.10.4_1...
[main-amd64-default-job-12] |   `-- Extracting py312-truststore-0.10.4_1: .......... done
[main-amd64-default-job-12] |   `-- Installing py312-typing-extensions-4.16.0...
[main-amd64-default-job-12] |   `-- Extracting py312-typing-extensions-4.16.0: .......... done
[main-amd64-default-job-12] `-- Extracting py312-anyio-4.15.1: .......... done
[main-amd64-default-job-12] `-- Installing py312-elastic-transport-9.4.2...
[main-amd64-default-job-12] |   `-- Installing py312-sniffio-1.3.1...
[main-amd64-default-job-12] |   `-- Extracting py312-sniffio-1.3.1: .......... done
[main-amd64-default-job-12] `-- Extracting py312-elastic-transport-9.4.2: .......... done
[main-amd64-default-job-12] `-- Installing py312-requests-2.34.2...
[main-amd64-default-job-12] |   `-- Installing py312-charset-normalizer-3.5.1...
[main-amd64-default-job-12] |   `-- Extracting py312-charset-normalizer-3.5.1: .......... done
[main-amd64-default-job-12] `-- Extracting py312-requests-2.34.2: .......... done
[main-amd64-default-job-12] Extracting py312-elasticsearch-9.5.1: .......... done
===>   py312-elasticsearch-curator-5.8.4_2 depends on package: py312-elasticsearch>=7.15.1 - found
===>   Returning to build of py312-elasticsearch-curator-5.8.4_2
===>   py312-elasticsearch-curator-5.8.4_2 depends on package: py312-requests-aws4auth>=0.9 - not found
===>   Installing existing package /packages/All/py312-requests-aws4auth-1.3.2.pkg
[main-amd64-default-job-12] Installing py312-requests-aws4auth-1.3.2...
[main-amd64-default-job-12] Extracting py312-requests-aws4auth-1.3.2: .......... done
===>   py312-elasticsearch-curator-5.8.4_2 depends on package: py312-requests-aws4auth>=0.9 - found
===>   Returning to build of py312-elasticsearch-curator-5.8.4_2
===>   py312-elasticsearch-curator-5.8.4_2 depends on package: py312-six>=1.11.0 - found
===>   py312-elasticsearch-curator-5.8.4_2 depends on package: py312-urllib3>=1.26.4 - found
===>   py312-elasticsearch-curator-5.8.4_2 depends on package: py312-voluptuous>=0.9.3 - not found
===>   Installing existing package /packages/All/py312-voluptuous-0.16.0.pkg
[main-amd64-default-job-12] Installing py312-voluptuous-0.16.0...
[main-amd64-default-job-12] Extracting py312-voluptuous-0.16.0: .......... done
===>   py312-elasticsearch-curator-5.8.4_2 depends on package: py312-voluptuous>=0.9.3 - found
===>   Returning to build of py312-elasticsearch-curator-5.8.4_2
===>   py312-elasticsearch-curator-5.8.4_2 depends on package: py312-pyyaml>=3.10 - not found
===>   Installing existing package /packages/All/py312-pyyaml-6.0.3_1.pkg
[main-amd64-default-job-12] Installing py312-pyyaml-6.0.3_1...
[main-amd64-default-job-12] `-- Installing libyaml-0.2.5...
[main-amd64-default-job-12] `-- Extracting libyaml-0.2.5: ......... done
[main-amd64-default-job-12] Extracting py312-pyyaml-6.0.3_1: .......... done
===>   py312-elasticsearch-curator-5.8.4_2 depends on package: py312-pyyaml>=3.10 - found
===>   Returning to build of py312-elasticsearch-curator-5.8.4_2
===>   py312-elasticsearch-curator-5.8.4_2 depends on file: /usr/local/bin/python3.12 - found
===>   py312-elasticsearch-curator-5.8.4_2 depends on package: py312-setuptools>=63.1.0 - not found
===>   Installing existing package /packages/All/py312-setuptools-63.1.0_3.pkg
[main-amd64-default-job-12] Installing py312-setuptools-63.1.0_3...
[main-amd64-default-job-12] Extracting py312-setuptools-63.1.0_3: .......... done
===>   py312-elasticsearch-curator-5.8.4_2 depends on package: py312-setuptools>=63.1.0 - found
===>   Returning to build of py312-elasticsearch-curator-5.8.4_2
===>   py312-elasticsearch-curator-5.8.4_2 depends on file: /usr/local/bin/python3.12 - found
===========================================================================
=======================<phase: lib-depends    >============================
===== env: USE_PACKAGE_DEPENDS_ONLY=1 USER=root UID=0 GID=0
===========================================================================
=======================<phase: configure      >============================
===== env: NO_DEPENDS=yes USER=root UID=0 GID=0
===>  Configuring for py312-elasticsearch-curator-5.8.4_2
/usr/local/lib/python3.12/site-packages/setuptools/installer.py:27: SetuptoolsDeprecationWarning: setuptools.installer is deprecated. Requirements should be satisfied by a PEP 517 installer.
  warnings.warn(
WARNING: The wheel package is not available.
/usr/local/bin/python3.12: No module named pip
Traceback (most recent call last):
  File "setup.py", line 39, in <module>
    from cx_Freeze import setup, Executable
ModuleNotFoundError: No module named 'cx_Freeze'

During handling of the above exception, another exception occurred:

Traceback (most recent call last):
  File "/usr/local/lib/python3.12/site-packages/setuptools/installer.py", line 82, in fetch_build_egg
    subprocess.check_call(cmd)
  File "/usr/local/lib/python3.12/subprocess.py", line 413, in check_call
    raise CalledProcessError(retcode, cmd)
subprocess.CalledProcessError: Command '['/usr/local/bin/python3.12', '-m', 'pip', '--disable-pip-version-check', 'wheel', '--no-deps', '-w', '/tmp/tmpk36t6lrj', '--quiet', 'elasticsearch<8.0.0,>=7.12.0']' returned non-zero exit status 1.

The above exception was the direct cause of the following exception:

Traceback (most recent call last):
  File "<string>", line 1, in <module>
  File "setup.py", line 144, in <module>
    setup(
  File "/usr/local/lib/python3.12/site-packages/setuptools/__init__.py", line 86, in setup
    _install_setup_requires(attrs)
  File "/usr/local/lib/python3.12/site-packages/setuptools/__init__.py", line 80, in _install_setup_requires
    dist.fetch_build_eggs(dist.setup_requires)
  File "/usr/local/lib/python3.12/site-packages/setuptools/dist.py", line 875, in fetch_build_eggs
    resolved_dists = pkg_resources.working_set.resolve(
                     ^^^^^^^^^^^^^^^^^^^^^^^^^^^^^^^^^^
  File "/usr/local/lib/python3.12/site-packages/pkg_resources/__init__.py", line 789, in resolve
    dist = best[req.key] = env.best_match(
                           ^^^^^^^^^^^^^^^
  File "/usr/local/lib/python3.12/site-packages/pkg_resources/__init__.py", line 1075, in best_match
    return self.obtain(req, installer)
           ^^^^^^^^^^^^^^^^^^^^^^^^^^^
  File "/usr/local/lib/python3.12/site-packages/pkg_resources/__init__.py", line 1087, in obtain
    return installer(requirement)
           ^^^^^^^^^^^^^^^^^^^^^^
  File "/usr/local/lib/python3.12/site-packages/setuptools/dist.py", line 945, in fetch_build_egg
    return fetch_build_egg(self, req)
           ^^^^^^^^^^^^^^^^^^^^^^^^^^
  File "/usr/local/lib/python3.12/site-packages/setuptools/installer.py", line 84, in fetch_build_egg
    raise DistutilsError(str(e)) from e
distutils.errors.DistutilsError: Command '['/usr/local/bin/python3.12', '-m', 'pip', '--disable-pip-version-check', 'wheel', '--no-deps', '-w', '/tmp/tmpk36t6lrj', '--quiet', 'elasticsearch<8.0.0,>=7.12.0']' returned non-zero exit status 1.
*** Error code 1

Stop.
make: stopped making "configure" in /usr/ports/textproc/py-elasticsearch-curator

From nobody Wed Oct  7 00:23:52 2026
X-Original-To: elastic@mlmmj.nyi.freebsd.org
Received: from mx1.freebsd.org (mx1.freebsd.org [IPv6:2610:1c1:1:606c::19:1])
	by mlmmj.nyi.freebsd.org (Postfix) with ESMTP id 4hzv4T0Vm9z6jxYw
	for <elastic@mlmmj.nyi.freebsd.org>; Wed, 07 Oct 2026 00:23:53 +0000 (UTC)
	(envelope-from pkg-fallout@FreeBSD.org)
Received: from mxrelay.chi.freebsd.org (mxrelay.chi.freebsd.org [IPv6:2610:1c0:1040:6064::19:3])
	(using TLSv1.3 with cipher TLS_AES_256_GCM_SHA384 (256/256 bits)
	 key-exchange x25519 server-signature RSA-PSS (4096 bits) server-digest SHA256
	 client-signature ECDSA (prime256v1) client-digest SHA256)
	(Client CN "mxrelay.chi.freebsd.org", Issuer "YE2" (not verified))
	by mx1.freebsd.org (Postfix) with ESMTPS id 4hzv4S46Cnz4Dmx
	for <elastic@FreeBSD.org>; Wed, 07 Oct 2026 00:23:52 +0000 (UTC)
	(envelope-from pkg-fallout@FreeBSD.org)
ARC-Seal: i=1; a=rsa-sha256; d=freebsd.org; s=dkim; cv=none; t=1791332632;
	b=OLzSC/aGH0ZA49XWsUveAnbsgDWd8V+Lg6SfAqsTME0hMowiyrO3zWyPxSbneQWkonZdhL
	DEdzJnNKXudysKemOp+/c6FZVXOzIqkjvpucVYxBcWWUfNeOPXAcGcbbnd15zLHELPMNRy
	Rx5dOSnX8c5G/6Co0iB7oEYfnBN8JE0aqXOUdbrdRvvtl3Zb7aD/Xutrt7kN8KfkZRAHUU
	2Vsr3VWzDGnSo8wff1CQO7z3K6LzrDYOnyn8wkVG/6QsjAndU2NfvTjjmHX/XJOC42O3Kh
	TQAzpxq9DbKwpdQMuYvsfhqPXmqJYaZmZkDXOC6YYV2m6aIQK1RKLBkGFgR24A==
ARC-Message-Signature: i=1; a=rsa-sha256; c=relaxed/relaxed; d=freebsd.org;
	s=dkim; t=1791332632;
	h=from:from:reply-to:subject:subject:date:date:message-id:message-id:
	 to:to:cc:cc; bh=unV3luBYH9LERRuzw+hwgY8gg2bCGSlLmKk4BgNQMx8=;
	b=JOKmsCZ0SwIx9efZUjy20SVLvR3yKQYSkpz8qkmxXrOKnx7bzmCuu6d/3iw0lD8ZWNO2PN
	9HyeLAx2xLp68PCuEUlYNmt2sm64WZqfpQw+V6MZ3oY3g/6fq/D8MnTOk2HYClrFBowzUT
	vsA+Yd/gSelwQn1XiGCfzpsctcjWHvCtC3d3uRWaBrcb2DroH+q7E7BwSGOM/IqKjKmZu4
	/+Hejy12pfmg1bBOEa9wB4QhRk7SfhIxUfX3nt7B9YZwpRYIY02EtB3A9lMJn5+i8EO3Mm
	pbd3DodB6u2It6l8coGB7/GWtRUZEtu7IRGHaOBVf9wlQNx0zJ+YT5CK1NtDbw==
ARC-Authentication-Results: i=1;
	mx1.freebsd.org;
	none
Received: from beefy23.chi.freebsd.org (beefy23.chi.freebsd.org [IPv6:2610:1c0:1040:6080::16:19])
	by mxrelay.chi.freebsd.org (Postfix) with ESMTP id 54C8A8BE0
	for <elastic@FreeBSD.org>; Wed, 07 Oct 2026 00:23:52 +0000 (UTC)
	(envelope-from pkg-fallout@FreeBSD.org)
Received: from root (uid 0)
	(envelope-from pkg-fallout@FreeBSD.org)
	id 1cd
	by beefy23.chi.freebsd.org (DragonFly Mail Agent v0.13+ on beefy23.chi.freebsd.org);
	Wed, 07 Oct 2026 00:23:52 +0000
To: elastic@FreeBSD.org
Subject: [package - 151amd64-default][textproc/py-elasticsearch-curator] Failed for py312-elasticsearch-curator-5.8.4_2 in configure
Cc: pkg-fallout@FreeBSD.org
Date: Wed, 07 Oct 2026 00:23:52 +0000
Message-Id: <6ac59118.1cd.2e6ca528@beefy23.chi.freebsd.org>
From: <pkg-fallout@FreeBSD.org>
List-Id: Support of ElasticSearch-related ports <freebsd-elastic.freebsd.org>
List-Archive: https://lists.freebsd.org/archives/freebsd-elastic
List-Help: <mailto:freebsd-elastic+help@freebsd.org>
List-Post: <mailto:freebsd-elastic@freebsd.org>
List-Subscribe: <mailto:freebsd-elastic+subscribe@freebsd.org>
List-Unsubscribe: <mailto:freebsd-elastic+unsubscribe@freebsd.org>
Sender: owner-freebsd-elastic@FreeBSD.org
List-Id: <freebsd-elastic.FreeBSD.org>
List-Post: <mailto:freebsd-elastic@FreeBSD.org>
List-Help: <mailto:freebsd-elastic+help@FreeBSD.org>
List-Subscribe: <mailto:freebsd-elastic+subscribe@FreeBSD.org>
List-Unsubscribe: <mailto:freebsd-elastic+unsubscribe@FreeBSD.org>
List-Owner: <mailto:postmaster@FreeBSD.org>
Precedence: list

You are receiving this mail as a port that you maintain
is failing to build on the FreeBSD package build server.
Please investigate the failure and submit a PR to fix
build.

Maintainer:     elastic@FreeBSD.org
Log URL:        https://pkg-status.freebsd.org/beefy23/data/151amd64-default/0b23c55e5d2c/logs/py312-elasticsearch-curator-5.8.4_2.log
Build URL:      https://pkg-status.freebsd.org/beefy23/build.html?mastername=151amd64-default&build=0b23c55e5d2c
Log:

=>> Building textproc/py-elasticsearch-curator
build started at Wed Oct  7 00:23:47 UTC 2026
port directory: /usr/ports/textproc/py-elasticsearch-curator
package name: py312-elasticsearch-curator-5.8.4_2
building for: FreeBSD 151amd64-default-job-07 15.1-RELEASE-p4 FreeBSD 15.1-RELEASE-p4 amd64
maintained by: elastic@FreeBSD.org
Makefile datestamp: -rw-r--r--  1 root wheel 1203 Sep 30  2025 /usr/ports/textproc/py-elasticsearch-curator/Makefile
Ports top last git commit: 0b23c55e5d2cdcb4a5d8d11bfc2f9c56cc6348ab
Ports top unclean checkout: no
Port dir last git commit: b64b73fd938d5b2788547d16ed6a76493acc9142
Port dir unclean checkout: no
Poudriere version: poudriere-git-3.4.8-3-gd92fb7c0
Host OSVERSION: 1600022
Jail OSVERSION: 1501000
Job Id: 07

---Begin Environment---
SHELL=/bin/sh
OSVERSION=1501000
UNAME_v=FreeBSD 15.1-RELEASE-p4
UNAME_r=15.1-RELEASE-p4
BLOCKSIZE=K
MAIL=/var/mail/root
MM_CHARSET=UTF-8
LANG=C.UTF-8
STATUS=1
HOME=/root
PATH=/sbin:/bin:/usr/sbin:/usr/bin:/usr/local/sbin:/usr/local/bin:/root/bin
MAKE_OBJDIR_CHECK_WRITABLE=0
LOCALBASE=/usr/local
USER=root
POUDRIERE_NAME=poudriere-git
LIBEXECPREFIX=/usr/local/libexec/poudriere
POUDRIERE_VERSION=3.4.8-3-gd92fb7c0
MASTERMNT=/usr/local/poudriere/data/.m/151amd64-default/ref
LC_COLLATE=C
POUDRIERE_BUILD_TYPE=bulk
PACKAGE_BUILDING=yes
SAVED_TERM=
OUTPUT_REDIRECTED_STDERR=4
OUTPUT_REDIRECTED=1
PWD=/usr/local/poudriere/data/.m/151amd64-default/07/.p
OUTPUT_REDIRECTED_STDOUT=3
P_PORTS_FEATURES=FLAVORS SUBPACKAGES SELECTED_OPTIONS
MASTERNAME=151amd64-default
SCRIPTPREFIX=/usr/local/share/poudriere
SCRIPTNAME=bulk.sh
OLDPWD=/usr/local/poudriere/data/.m/151amd64-default/ref/.p/pool
POUDRIERE_PKGNAME=poudriere-git-3.4.8-3-gd92fb7c0
SCRIPTPATH=/usr/local/share/poudriere/bulk.sh
POUDRIEREPATH=/usr/local/bin/poudriere
---End Environment---

---Begin Poudriere Port Flags/Env---
PORT_FLAGS=
PKGENV=
FLAVOR=py312
MAKE_ARGS= FLAVOR=py312
---End Poudriere Port Flags/Env---

---Begin OPTIONS List---
---End OPTIONS List---

--MAINTAINER--
elastic@FreeBSD.org
--End MAINTAINER--

--CONFIGURE_ARGS--

--End CONFIGURE_ARGS--

--CONFIGURE_ENV--
PYTHON="/usr/local/bin/python3.12" XDG_DATA_HOME=/wrkdirs/usr/ports/textproc/py-elasticsearch-curator/work-py312  XDG_CONFIG_HOME=/wrkdirs/usr/ports/textproc/py-elasticsearch-curator/work-py312  XDG_CACHE_HOME=/wrkdirs/usr/ports/textproc/py-elasticsearch-curator/work-py312/.cache  HOME=/wrkdirs/usr/ports/textproc/py-elasticsearch-curator/work-py312 TMPDIR="/tmp" PATH=/wrkdirs/usr/ports/textproc/py-elasticsearch-curator/work-py312/.bin:/sbin:/bin:/usr/sbin:/usr/bin:/usr/local/sbin:/usr/local/bin:/root/bin PKG_CONFIG_LIBDIR=/wrkdirs/usr/ports/textproc/py-elasticsearch-curator/work-py312/.pkgconfig:/usr/local/libdata/pkgconfig:/usr/local/share/pkgconfig:/usr/libdata/pkgconfig SHELL=/bin/sh CONFIG_SHELL=/bin/sh
--End CONFIGURE_ENV--

--MAKE_ENV--
XDG_DATA_HOME=/wrkdirs/usr/ports/textproc/py-elasticsearch-curator/work-py312  XDG_CONFIG_HOME=/wrkdirs/usr/ports/textproc/py-elasticsearch-curator/work-py312  XDG_CACHE_HOME=/wrkdirs/usr/ports/textproc/py-elasticsearch-curator/work-py312/.cache  HOME=/wrkdirs/usr/ports/textproc/py-elasticsearch-curator/work-py312 TMPDIR="/tmp" PATH=/wrkdirs/usr/ports/textproc/py-elasticsearch-curator/work-py312/.bin:/sbin:/bin:/usr/sbin:/usr/bin:/usr/local/sbin:/usr/local/bin:/root/bin PKG_CONFIG_LIBDIR=/wrkdirs/usr/ports/textproc/py-elasticsearch-curator/work-py312/.pkgconfig:/usr/local/libdata/pkgconfig:/usr/local/share/pkgconfig:/usr/libdata/pkgconfig MK_DEBUG_FILES=no MK_KERNEL_SYMBOLS=no SHELL=/bin/sh NO_LINT=YES LDSHARED="cc -shared" PYTHONDONTWRITEBYTECODE= PYTHONOPTIMIZE= PREFIX=/usr/local  LOCALBASE=/usr/local  CC="cc" CFLAGS="-O2 -pipe  -fstack-protector-strong -fno-strict-aliasing "  CPP="cpp" CPPFLAGS=""  LDFLAGS=" " LIBS=""  CXX="c++" CXXFLAGS="-O2 -pipe -fstack-protector-stron
g -fno-strict-aliasing   " BSD_INSTALL_PROGRAM="install  -s -m 555"  BSD_INSTALL_LIB="install  -s -m 0644"  BSD_INSTALL_SCRIPT="install  -m 555"  BSD_INSTALL_DATA="install  -m 0644"  BSD_INSTALL_MAN="install  -m 444"
--End MAKE_ENV--

--PLIST_SUB--
PYTHON_INCLUDEDIR=include/python3.12  PYTHON_LIBDIR=lib/python3.12  PYTHON_PLATFORM=freebsd15  PYTHON_SITELIBDIR=lib/python3.12/site-packages  PYTHON_SUFFIX=312  PYTHON_BASESUFFIX=312  PYTHON_TAG=.cpython-312  PYTHON_SOABI=.cpython-312  PYTHON_VER=3.12  PYTHON_BASEVER=3.12  PYTHON_VERSION=python3.12 PYTHON2="@comment " PYTHON3="" OSREL=15.1 PREFIX=%D LOCALBASE=/usr/local  RESETPREFIX=/usr/local LIB32DIR=lib DOCSDIR="share/doc/elasticsearch-curator"  EXAMPLESDIR="share/examples/elasticsearch-curator"  DATADIR="share/elasticsearch-curator"  WWWDIR="www/elasticsearch-curator"  ETCDIR="etc/elasticsearch-curator"
--End PLIST_SUB--

--SUB_LIST--
PYTHON_INCLUDEDIR=/usr/local/include/python3.12  PYTHON_LIBDIR=/usr/local/lib/python3.12  PYTHON_PLATFORM=freebsd15  PYTHON_SITELIBDIR=/usr/local/lib/python3.12/site-packages  PYTHON_SUFFIX=312  PYTHON_BASESUFFIX=312  PYTHON_TAG=.cpython-312  PYTHON_SOABI=.cpython-312  PYTHON_VER=3.12  PYTHON_BASEVER=3.12  PYTHON_VERSION=python3.12 PYTHON2="@comment " PYTHON3="" PREFIX=/usr/local LOCALBASE=/usr/local  DATADIR=/usr/local/share/elasticsearch-curator DOCSDIR=/usr/local/share/doc/elasticsearch-curator EXAMPLESDIR=/usr/local/share/examples/elasticsearch-curator  WWWDIR=/usr/local/www/elasticsearch-curator ETCDIR=/usr/local/etc/elasticsearch-curator
--End SUB_LIST--

---Begin make.conf---
USE_PACKAGE_DEPENDS=yes
BATCH=yes
WRKDIRPREFIX=/wrkdirs
PORTSDIR=/usr/ports
PACKAGES=/packages
DISTDIR=/distfiles
PACKAGE_BUILDING=yes
PACKAGE_BUILDING_FLAVORS=yes
####  ####
# XXX: We really need this but cannot use it while 'make checksum' does not
# try the next mirror on checksum failure.  It currently retries the same
# failed mirror and then fails rather then trying another.  It *does*
# try the next if the size is mismatched though.
#MASTER_SITE_FREEBSD=yes
# Build ALLOW_MAKE_JOBS_PACKAGES with 3 jobs
MAKE_JOBS_NUMBER=3
#### Misc Poudriere ####
.include "/etc/make.conf.ports_env"
GID=0
UID=0
---End make.conf---
--Resource limits--
cpu time               (seconds, -t)  unlimited
file size           (512-blocks, -f)  unlimited
data seg size           (kbytes, -d)  33554432
stack size              (kbytes, -s)  524288
core file size      (512-blocks, -c)  unlimited
max memory size         (kbytes, -m)  unlimited
locked memory           (kbytes, -l)  unlimited
max user processes              (-u)  89999
open files                      (-n)  8192
virtual mem size        (kbytes, -v)  unlimited
swap limit              (kbytes, -w)  unlimited
socket buffer size       (bytes, -b)  unlimited
pseudo-terminals                (-p)  unlimited
kqueues                         (-k)  unlimited
umtx shared locks               (-o)  unlimited
pipebuf                         (-y)  unlimited
--End resource limits--
=======================<phase: check-sanity   >============================
===== env: NO_DEPENDS=yes USER=root UID=0 GID=0
===>  License APACHE20 accepted by the user
===========================================================================
=======================<phase: pkg-depends    >============================
===== env: USE_PACKAGE_DEPENDS_ONLY=1 USER=root UID=0 GID=0
===>   py312-elasticsearch-curator-5.8.4_2 depends on file: /usr/local/sbin/pkg - not found
===>   Installing existing package /packages/All/pkg-2.8.4.pkg
[151amd64-default-job-07] Installing pkg-2.8.4...
[151amd64-default-job-07] Extracting pkg-2.8.4: .......... done
===>   py312-elasticsearch-curator-5.8.4_2 depends on file: /usr/local/sbin/pkg - found
===>   Returning to build of py312-elasticsearch-curator-5.8.4_2
===========================================================================
=======================<phase: fetch-depends  >============================
===== env: USE_PACKAGE_DEPENDS_ONLY=1 USER=root UID=0 GID=0
===========================================================================
=======================<phase: fetch          >============================
===== env: NO_DEPENDS=yes USER=root UID=0 GID=0
===>  License APACHE20 accepted by the user
===> Fetching all distfiles required by py312-elasticsearch-curator-5.8.4_2 for building
===========================================================================
=======================<phase: checksum       >============================
===== env: NO_DEPENDS=yes USER=root UID=0 GID=0
===>  License APACHE20 accepted by the user
===> Fetching all distfiles required by py312-elasticsearch-curator-5.8.4_2 for building
=> SHA256 Checksum OK for elastic-curator-v5.8.4_GH0.tar.gz.
===========================================================================
=======================<phase: extract-depends>============================
===== env: USE_PACKAGE_DEPENDS_ONLY=1 USER=root UID=0 GID=0
===========================================================================
=======================<phase: extract        >============================
===== env: NO_DEPENDS=yes USER=root UID=0 GID=0
===>  License APACHE20 accepted by the user
===> Fetching all distfiles required by py312-elasticsearch-curator-5.8.4_2 for building
===>  Extracting for py312-elasticsearch-curator-5.8.4_2
=> SHA256 Checksum OK for elastic-curator-v5.8.4_GH0.tar.gz.
===========================================================================
=======================<phase: patch-depends  >============================
===== env: USE_PACKAGE_DEPENDS_ONLY=1 USER=root UID=0 GID=0
===========================================================================
=======================<phase: patch          >============================
===== env: NO_DEPENDS=yes USER=root UID=0 GID=0
===>  Patching for py312-elasticsearch-curator-5.8.4_2
===>  Applying FreeBSD patches for py312-elasticsearch-curator-5.8.4_2 from /usr/ports/textproc/py-elasticsearch-curator/files
===========================================================================
=======================<phase: build-depends  >============================
===== env: USE_PACKAGE_DEPENDS_ONLY=1 USER=root UID=0 GID=0
===>   py312-elasticsearch-curator-5.8.4_2 depends on package: py312-boto3>=1.7.24 - not found
===>   Installing existing package /packages/All/py312-boto3-1.43.99.pkg
[151amd64-default-job-07] Installing py312-boto3-1.43.99...
[151amd64-default-job-07] `-- Installing py312-botocore-1.43.99...
[151amd64-default-job-07] |   `-- Installing py312-jmespath-1.1.0...
[151amd64-default-job-07] |   | `-- Installing python312-3.12.14_1...
[151amd64-default-job-07] |   |   `-- Installing expat-2.8.5...
[151amd64-default-job-07] |   |   `-- Extracting expat-2.8.5: .......... done
[151amd64-default-job-07] |   |   `-- Installing gettext-runtime-1.0_1...
[151amd64-default-job-07] |   |   | `-- Installing indexinfo-0.3.1_1...
[151amd64-default-job-07] |   |   | `-- Extracting indexinfo-0.3.1_1: .... done
[151amd64-default-job-07] |   |   `-- Extracting gettext-runtime-1.0_1: .......... done
[151amd64-default-job-07] |   |   `-- Installing libffi-3.8.0...
[151amd64-default-job-07] |   |   `-- Extracting libffi-3.8.0: .......... done
[151amd64-default-job-07] |   |   `-- Installing mpdecimal-4.0.1...
[151amd64-default-job-07] |   |   `-- Extracting mpdecimal-4.0.1: .......... done
[151amd64-default-job-07] |   |   `-- Installing readline-8.3.6...
[151amd64-default-job-07] |   |   `-- Extracting readline-8.3.6: .......... done
[151amd64-default-job-07] |   | `-- Extracting python312-3.12.14_1: .......... done
[151amd64-default-job-07] |   `-- Extracting py312-jmespath-1.1.0: .......... done
[151amd64-default-job-07] |   `-- Installing py312-python-dateutil-2.9.0...
[151amd64-default-job-07] |   | `-- Installing py312-six-1.17.0...
[151amd64-default-job-07] |   | `-- Extracting py312-six-1.17.0: .......... done
[151amd64-default-job-07] |   `-- Extracting py312-python-dateutil-2.9.0: .......... done
[151amd64-default-job-07] |   `-- Installing py312-urllib3-2.8.0,1...
[151amd64-default-job-07] |   | `-- Installing py312-pysocks-1.7.1_1...
[151amd64-default-job-07] |   | `-- Extracting py312-pysocks-1.7.1_1: .......... done
[151amd64-default-job-07] |   `-- Extracting py312-urllib3-2.8.0,1: .......... done
[151amd64-default-job-07] `-- Extracting py312-botocore-1.43.99: .......... done
[151amd64-default-job-07] `-- Installing py312-s3transfer-0.19.2...
[151amd64-default-job-07] `-- Extracting py312-s3transfer-0.19.2: .......... done
[151amd64-default-job-07] Extracting py312-boto3-1.43.99: .......... done
=====
Message from python312-3.12.14_1:

--
Note that some standard Python modules are provided as separate ports
as they require additional dependencies. They are available as:

py312-gdbm       databases/py-gdbm@py312
py312-sqlite3    databases/py-sqlite3@py312
py312-tkinter    x11-toolkits/py-tkinter@py312
=====
Message from py312-urllib3-2.8.0,1:

--
Since version 1.25 HTTPS connections are now verified by default which is done
via "cert_reqs = 'CERT_REQUIRED'".  While certificate verification can be
disabled via "cert_reqs = 'CERT_NONE'", it's highly recommended to leave it on.

Various consumers of net/py-urllib3 already have implemented routines that
either explicitly enable or disable HTTPS certificate verification (e.g. via
configuration settings, CLI arguments, etc.).

Yet it may happen that there are still some consumers which don't explicitly
enable/disable certificate verification for HTTPS connections which could then
lead to errors (as is often the case with self-signed certificates).

In case of an error one should try first to temporarily disable certificate
verification of the problematic urllib3 consumer to see if that approach will
remedy the issue.
===>   py312-elasticsearch-curator-5.8.4_2 depends on package: py312-boto3>=1.7.24 - found
===>   Returning to build of py312-elasticsearch-curator-5.8.4_2
===>   py312-elasticsearch-curator-5.8.4_2 depends on package: py312-certifi>=2018.10.15 - not found
===>   Installing existing package /packages/All/py312-certifi-2026.7.22.pkg
[151amd64-default-job-07] Installing py312-certifi-2026.7.22...
[151amd64-default-job-07] Extracting py312-certifi-2026.7.22: .......... done
===>   py312-elasticsearch-curator-5.8.4_2 depends on package: py312-certifi>=2018.10.15 - found
===>   Returning to build of py312-elasticsearch-curator-5.8.4_2
===>   py312-elasticsearch-curator-5.8.4_2 depends on package: py312-click7>=7.1.2 - not found
===>   Installing existing package /packages/All/py312-click7-7.1.2_1.pkg
[151amd64-default-job-07] Installing py312-click7-7.1.2_1...
[151amd64-default-job-07] Extracting py312-click7-7.1.2_1: .......... done
===>   py312-elasticsearch-curator-5.8.4_2 depends on package: py312-click7>=7.1.2 - found
===>   Returning to build of py312-elasticsearch-curator-5.8.4_2
===>   py312-elasticsearch-curator-5.8.4_2 depends on package: py312-elasticsearch>=7.15.1 - not found
===>   Installing existing package /packages/All/py312-elasticsearch-9.5.1.pkg
[151amd64-default-job-07] Installing py312-elasticsearch-9.5.1...
[151amd64-default-job-07] `-- Installing py312-anyio-4.15.1...
[151amd64-default-job-07] |   `-- Installing py312-idna-3.20...
[151amd64-default-job-07] |   `-- Extracting py312-idna-3.20: .......... done
[151amd64-default-job-07] |   `-- Installing py312-truststore-0.10.4_1...
[151amd64-default-job-07] |   `-- Extracting py312-truststore-0.10.4_1: .......... done
[151amd64-default-job-07] |   `-- Installing py312-typing-extensions-4.16.0...
[151amd64-default-job-07] |   `-- Extracting py312-typing-extensions-4.16.0: .......... done
[151amd64-default-job-07] `-- Extracting py312-anyio-4.15.1: .......... done
[151amd64-default-job-07] `-- Installing py312-elastic-transport-9.4.2...
[151amd64-default-job-07] |   `-- Installing py312-sniffio-1.3.1...
[151amd64-default-job-07] |   `-- Extracting py312-sniffio-1.3.1: .......... done
[151amd64-default-job-07] `-- Extracting py312-elastic-transport-9.4.2: .......... done
[151amd64-default-job-07] `-- Installing py312-requests-2.34.2...
[151amd64-default-job-07] |   `-- Installing py312-charset-normalizer-3.5.1...
[151amd64-default-job-07] |   `-- Extracting py312-charset-normalizer-3.5.1: .......... done
[151amd64-default-job-07] `-- Extracting py312-requests-2.34.2: .......... done
[151amd64-default-job-07] Extracting py312-elasticsearch-9.5.1: .......... done
===>   py312-elasticsearch-curator-5.8.4_2 depends on package: py312-elasticsearch>=7.15.1 - found
===>   Returning to build of py312-elasticsearch-curator-5.8.4_2
===>   py312-elasticsearch-curator-5.8.4_2 depends on package: py312-requests-aws4auth>=0.9 - not found
===>   Installing existing package /packages/All/py312-requests-aws4auth-1.3.2.pkg
[151amd64-default-job-07] Installing py312-requests-aws4auth-1.3.2...
[151amd64-default-job-07] Extracting py312-requests-aws4auth-1.3.2: .......... done
===>   py312-elasticsearch-curator-5.8.4_2 depends on package: py312-requests-aws4auth>=0.9 - found
===>   Returning to build of py312-elasticsearch-curator-5.8.4_2
===>   py312-elasticsearch-curator-5.8.4_2 depends on package: py312-six>=1.11.0 - found
===>   py312-elasticsearch-curator-5.8.4_2 depends on package: py312-urllib3>=1.26.4 - found
===>   py312-elasticsearch-curator-5.8.4_2 depends on package: py312-voluptuous>=0.9.3 - not found
===>   Installing existing package /packages/All/py312-voluptuous-0.16.0.pkg
[151amd64-default-job-07] Installing py312-voluptuous-0.16.0...
[151amd64-default-job-07] Extracting py312-voluptuous-0.16.0: .......... done
===>   py312-elasticsearch-curator-5.8.4_2 depends on package: py312-voluptuous>=0.9.3 - found
===>   Returning to build of py312-elasticsearch-curator-5.8.4_2
===>   py312-elasticsearch-curator-5.8.4_2 depends on package: py312-pyyaml>=3.10 - not found
===>   Installing existing package /packages/All/py312-pyyaml-6.0.3_1.pkg
[151amd64-default-job-07] Installing py312-pyyaml-6.0.3_1...
[151amd64-default-job-07] `-- Installing libyaml-0.2.5...
[151amd64-default-job-07] `-- Extracting libyaml-0.2.5: ......... done
[151amd64-default-job-07] Extracting py312-pyyaml-6.0.3_1: .......... done
===>   py312-elasticsearch-curator-5.8.4_2 depends on package: py312-pyyaml>=3.10 - found
===>   Returning to build of py312-elasticsearch-curator-5.8.4_2
===>   py312-elasticsearch-curator-5.8.4_2 depends on file: /usr/local/bin/python3.12 - found
===>   py312-elasticsearch-curator-5.8.4_2 depends on package: py312-setuptools>=63.1.0 - not found
===>   Installing existing package /packages/All/py312-setuptools-63.1.0_3.pkg
[151amd64-default-job-07] Installing py312-setuptools-63.1.0_3...
[151amd64-default-job-07] Extracting py312-setuptools-63.1.0_3: .......... done
===>   py312-elasticsearch-curator-5.8.4_2 depends on package: py312-setuptools>=63.1.0 - found
===>   Returning to build of py312-elasticsearch-curator-5.8.4_2
===>   py312-elasticsearch-curator-5.8.4_2 depends on file: /usr/local/bin/python3.12 - found
===========================================================================
=======================<phase: lib-depends    >============================
===== env: USE_PACKAGE_DEPENDS_ONLY=1 USER=root UID=0 GID=0
===========================================================================
=======================<phase: configure      >============================
===== env: NO_DEPENDS=yes USER=root UID=0 GID=0
===>  Configuring for py312-elasticsearch-curator-5.8.4_2
/usr/local/lib/python3.12/site-packages/setuptools/installer.py:27: SetuptoolsDeprecationWarning: setuptools.installer is deprecated. Requirements should be satisfied by a PEP 517 installer.
  warnings.warn(
WARNING: The wheel package is not available.
/usr/local/bin/python3.12: No module named pip
Traceback (most recent call last):
  File "setup.py", line 39, in <module>
    from cx_Freeze import setup, Executable
ModuleNotFoundError: No module named 'cx_Freeze'

During handling of the above exception, another exception occurred:

Traceback (most recent call last):
  File "/usr/local/lib/python3.12/site-packages/setuptools/installer.py", line 82, in fetch_build_egg
    subprocess.check_call(cmd)
  File "/usr/local/lib/python3.12/subprocess.py", line 413, in check_call
    raise CalledProcessError(retcode, cmd)
subprocess.CalledProcessError: Command '['/usr/local/bin/python3.12', '-m', 'pip', '--disable-pip-version-check', 'wheel', '--no-deps', '-w', '/tmp/tmpkcloq_os', '--quiet', 'elasticsearch<8.0.0,>=7.12.0']' returned non-zero exit status 1.

The above exception was the direct cause of the following exception:

Traceback (most recent call last):
  File "<string>", line 1, in <module>
  File "setup.py", line 144, in <module>
    setup(
  File "/usr/local/lib/python3.12/site-packages/setuptools/__init__.py", line 86, in setup
    _install_setup_requires(attrs)
  File "/usr/local/lib/python3.12/site-packages/setuptools/__init__.py", line 80, in _install_setup_requires
    dist.fetch_build_eggs(dist.setup_requires)
  File "/usr/local/lib/python3.12/site-packages/setuptools/dist.py", line 875, in fetch_build_eggs
    resolved_dists = pkg_resources.working_set.resolve(
                     ^^^^^^^^^^^^^^^^^^^^^^^^^^^^^^^^^^
  File "/usr/local/lib/python3.12/site-packages/pkg_resources/__init__.py", line 789, in resolve
    dist = best[req.key] = env.best_match(
                           ^^^^^^^^^^^^^^^
  File "/usr/local/lib/python3.12/site-packages/pkg_resources/__init__.py", line 1075, in best_match
    return self.obtain(req, installer)
           ^^^^^^^^^^^^^^^^^^^^^^^^^^^
  File "/usr/local/lib/python3.12/site-packages/pkg_resources/__init__.py", line 1087, in obtain
    return installer(requirement)
           ^^^^^^^^^^^^^^^^^^^^^^
  File "/usr/local/lib/python3.12/site-packages/setuptools/dist.py", line 945, in fetch_build_egg
    return fetch_build_egg(self, req)
           ^^^^^^^^^^^^^^^^^^^^^^^^^^
  File "/usr/local/lib/python3.12/site-packages/setuptools/installer.py", line 84, in fetch_build_egg
    raise DistutilsError(str(e)) from e
distutils.errors.DistutilsError: Command '['/usr/local/bin/python3.12', '-m', 'pip', '--disable-pip-version-check', 'wheel', '--no-deps', '-w', '/tmp/tmpkcloq_os', '--quiet', 'elasticsearch<8.0.0,>=7.12.0']' returned non-zero exit status 1.
*** Error code 1

Stop.
make: stopped making "configure" in /usr/ports/textproc/py-elasticsearch-curator

From nobody Wed Oct  7 04:50:41 2026
X-Original-To: elastic@mlmmj.nyi.freebsd.org
Received: from mx1.freebsd.org (mx1.freebsd.org [IPv6:2610:1c1:1:606c::19:1])
	by mlmmj.nyi.freebsd.org (Postfix) with ESMTP id 4j010K5dCJz6vFDc
	for <elastic@mlmmj.nyi.freebsd.org>; Wed, 07 Oct 2026 04:50:41 +0000 (UTC)
	(envelope-from portscout@FreeBSD.org)
Received: from mxrelay.nyi.freebsd.org (mxrelay.nyi.freebsd.org [IPv6:2610:1c1:1:606c::19:3])
	(using TLSv1.3 with cipher TLS_AES_256_GCM_SHA384 (256/256 bits)
	 key-exchange x25519 server-signature RSA-PSS (4096 bits) server-digest SHA256
	 client-signature RSA-PSS (4096 bits) client-digest SHA256)
	(Client CN "mxrelay.nyi.freebsd.org", Issuer "YR2" (not verified))
	by mx1.freebsd.org (Postfix) with ESMTPS id 4j010K2kjkz4tQg
	for <elastic@freebsd.org>; Wed, 07 Oct 2026 04:50:41 +0000 (UTC)
	(envelope-from portscout@FreeBSD.org)
ARC-Seal: i=1; a=rsa-sha256; d=freebsd.org; s=dkim; cv=none; t=1791348641;
	b=rcivbAx2K3kLV8+/xou1rZJnToESeUJDU3R+eypS6Mtz+kVzo/i5n9/C+yToAc0iggzYv4
	4IonEWcphop7BTqSFnI0VroH75oAHTlzrC0apYy4b24PiAJDfvNqkoN8wcenhQk4/mzO+a
	gAkT5Iyy6PudJ6FBLtflVGnWeBU1FbDrMkU5l8MGax2+2I3//XGIXQHom4GTzp9787b5Pg
	LoH5zp+1pf/4Z8iHwZx/N3O78gVV5hGwDhOLgi9ti1JjfQxjSXffkmdATsmqwEa+IAbAsA
	HBIeRZGoMg7L3T3NVhN4qOS19YMNs2pLEj/vheNTGRsO7hWd+VP0ghsmE4X1XA==
ARC-Message-Signature: i=1; a=rsa-sha256; c=relaxed/relaxed; d=freebsd.org;
	s=dkim; t=1791348641;
	h=from:from:reply-to:subject:subject:date:date:message-id:message-id:
	 to:to:cc:mime-version:mime-version:content-type:content-type:
	 content-transfer-encoding:content-transfer-encoding;
	bh=v7ZXoR1kc+HmXqZmbeqwDXQyWIlOw2lGEPI1rFmrm60=;
	b=a6Z3aJ6/gDPBKciL5YIYo4cr3ly34oy8GOC2VUqJ43zuVtkHHsZNWDh8SwVeTuB7XO+5l3
	8aeL+aoIl/EFjnnQyAAKLxeFUmH2FKXPtXF6HbbWNO8yF3Vpf91jUz66Sdn3w/EhxRQGZE
	K0ghCYCtw6JfrWOTvoV+FNSiLFHH09Wk3NzqqdayaY0ZStbSPAZIqGCPwieIfbCyB+aKh+
	1jm+lUh7Rh1C3aRS2E2kQTbrvnUsm0SwherjTx69BqsH6g/sAwE8MqV5KgXBrBYnhUxFhI
	HJ3z+iPsk/Oo447B2CDZEkh1Y1uQzWc+lT4mp1ucXHqfJo8WHEtwDHiI5V4IvA==
ARC-Authentication-Results: i=1;
	mx1.freebsd.org;
	none
Received: from portscout.nyi.freebsd.org (portscout.nyi.freebsd.org [IPv6:2610:1c1:1:606c::50:21])
	(using TLSv1.3 with cipher TLS_AES_256_GCM_SHA384 (256/256 bits)
	 key-exchange x25519 server-signature RSA-PSS (4096 bits) server-digest SHA256)
	(Client did not present a certificate)
	by mxrelay.nyi.freebsd.org (Postfix) with ESMTPS id 4j010K18fHzdd2
	for <elastic@freebsd.org>; Wed, 07 Oct 2026 04:50:41 +0000 (UTC)
	(envelope-from portscout@FreeBSD.org)
Received: from portscout.nyi.freebsd.org ([127.0.1.10])
	by portscout.nyi.freebsd.org (8.17.1/8.17.1) with ESMTP id 6974ofLh051120
	for <elastic@freebsd.org>; Wed, 7 Oct 2026 04:50:41 GMT
	(envelope-from portscout@FreeBSD.org)
Received: (from portscout@localhost)
	by portscout.nyi.freebsd.org (8.17.1/8.17.1/Submit) id 6974ofPg051119;
	Wed, 7 Oct 2026 04:50:41 GMT
	(envelope-from portscout@FreeBSD.org)
Message-Id: <202610070450.6974ofPg051119@portscout.nyi.freebsd.org>
X-Authentication-Warning: portscout.nyi.freebsd.org: portscout set sender to portscout@FreeBSD.org using -f
Content-Disposition: inline
Content-Transfer-Encoding: 8bit
Content-Type: text/plain
List-Id: Support of ElasticSearch-related ports <freebsd-elastic.freebsd.org>
List-Archive: https://lists.freebsd.org/archives/freebsd-elastic
List-Help: <mailto:freebsd-elastic+help@freebsd.org>
List-Post: <mailto:freebsd-elastic@freebsd.org>
List-Subscribe: <mailto:freebsd-elastic+subscribe@freebsd.org>
List-Unsubscribe: <mailto:freebsd-elastic+unsubscribe@freebsd.org>
Sender: owner-freebsd-elastic@FreeBSD.org
List-Id: <freebsd-elastic.FreeBSD.org>
List-Post: <mailto:freebsd-elastic@FreeBSD.org>
List-Help: <mailto:freebsd-elastic+help@FreeBSD.org>
List-Subscribe: <mailto:freebsd-elastic+subscribe@FreeBSD.org>
List-Unsubscribe: <mailto:freebsd-elastic+unsubscribe@FreeBSD.org>
List-Owner: <mailto:postmaster@FreeBSD.org>
Precedence: list
MIME-Version: 1.0
Date: Wed, 7 Oct 2026 04:50:41 +0000
From: portscout@FreeBSD.org
To: elastic@freebsd.org
Subject: FreeBSD ports you maintain which are out of date
X-Mailer: portscout/0.8.1

Dear port maintainer,

The portscout new distfile checker has detected that one or more of your
ports appears to be out of date. Please take the opportunity to check
each of the ports listed below, and if possible and appropriate,
submit/commit an update. If any ports have already been updated, you can
safely ignore the entry.

You will not be e-mailed again for any of the port/version combinations
below.

Full details can be found at the following URL:
http://portscout.freebsd.org/elastic@freebsd.org.html


Port                                            | Current version | New version
------------------------------------------------+-----------------+------------
sysutils/beats95                                | 9.5.4           | 9.5.5
------------------------------------------------+-----------------+------------
sysutils/logstash95                             | 9.5.4           | 9.5.5
------------------------------------------------+-----------------+------------
textproc/kibana8                                | 8.19.21         | 8.19.23
------------------------------------------------+-----------------+------------
textproc/kibana95                               | 9.5.4           | 9.5.5
------------------------------------------------+-----------------+------------


If any of the above results are invalid, please check the following page
for details on how to improve portscout's detection and selection of
distfiles on a per-port basis:

http://portscout.freebsd.org/info/portscout-portconfig.txt

Reported by:	portscout!

From nobody Wed Oct  7 05:23:29 2026
X-Original-To: elastic@mlmmj.nyi.freebsd.org
Received: from mx1.freebsd.org (mx1.freebsd.org [IPv6:2610:1c1:1:606c::19:1])
	by mlmmj.nyi.freebsd.org (Postfix) with ESMTP id 4j01kB4RgVz6vHcG
	for <elastic@mlmmj.nyi.freebsd.org>; Wed, 07 Oct 2026 05:23:30 +0000 (UTC)
	(envelope-from pkg-fallout@FreeBSD.org)
Received: from mxrelay.nyi.freebsd.org (mxrelay.nyi.freebsd.org [IPv6:2610:1c1:1:606c::19:3])
	(using TLSv1.3 with cipher TLS_AES_256_GCM_SHA384 (256/256 bits)
	 key-exchange x25519 server-signature RSA-PSS (4096 bits) server-digest SHA256
	 client-signature RSA-PSS (4096 bits) client-digest SHA256)
	(Client CN "mxrelay.nyi.freebsd.org", Issuer "YR2" (not verified))
	by mx1.freebsd.org (Postfix) with ESMTPS id 4j01kB0zqqz3FZD
	for <elastic@FreeBSD.org>; Wed, 07 Oct 2026 05:23:30 +0000 (UTC)
	(envelope-from pkg-fallout@FreeBSD.org)
ARC-Seal: i=1; a=rsa-sha256; d=freebsd.org; s=dkim; cv=none; t=1791350610;
	b=yTECnEU5jiwt2bOxTe97aFVeTq3uRe2sLWzEVHXEG8d9euBmMPvBS1jtYhLie2RuiZG/aI
	cfDt/LTpyF26yzvxWZY89Xma9AYIzhIO8JYR5HgtQbtRq47eMqLaG2HKGm+IQ2JKpJa+A/
	oSdwLYNFygLdXY0/AACZtx8radKoCUmW7QAswXNJY+xOwGhtZMefALDbhm4thxOlfj7u6q
	5FlR/8WZ0rtuJ7PQzJl4On7we56NuJNnr0CtM3Cc6Gf0QBzPYXRqUnyCulJYaMafIkvM6Y
	Pvts36yvYrmVhiHgjmPqieU59KF6uZ7a6q9UNTgOt0Pqyls2ZW0njUHduFBZqA==
ARC-Message-Signature: i=1; a=rsa-sha256; c=relaxed/relaxed; d=freebsd.org;
	s=dkim; t=1791350610;
	h=from:from:reply-to:subject:subject:date:date:message-id:message-id:
	 to:to:cc:cc; bh=BDNgR4JS2k1l17M/FRz+3eNJpzEDOaIXTbLC7FEW/7I=;
	b=v94wTbkdKj1MZZwqrgVlc/SLTpcXXUvi2iXoxtOJFeXNtGuQ+bgzsCJbAJLCgR9UcFUKaa
	kFwLPQOTAKuG1ip6W1yrfxNm+37KgnNaWyKyuzthj7+n5hhVfZ/n/Z6NgVQRbqc7nbLjRo
	yJHm9WlPH2cdHsz+bTcVTTaPuUScXrnvIWREXmf1EDDfQePUliiulbQE8rc0QvUA3nWA/Y
	OIXCTizBmD9ezuC3dJIfYenb9Bjszeo2GkXBSWgjx6NiPqqB29wrLz7OUejz+ipRiO5boo
	hnG19/cRdvevUNTC6myDNw7fsryZOeuLbwQvMh125ZonyqG5gdl8zGr30v0NSw==
ARC-Authentication-Results: i=1;
	mx1.freebsd.org;
	none
Received: from beefy18.nyi.freebsd.org (beefy18.nyi.freebsd.org [IPv6:2610:1c1:1:6080::16:21])
	by mxrelay.nyi.freebsd.org (Postfix) with ESMTP id 4j01kB01TqzgZC
	for <elastic@FreeBSD.org>; Wed, 07 Oct 2026 05:23:30 +0000 (UTC)
	(envelope-from pkg-fallout@FreeBSD.org)
Received: from root (uid 0)
	(envelope-from pkg-fallout@FreeBSD.org)
	id 3d8f
	by beefy18.nyi.freebsd.org (DragonFly Mail Agent v0.13+ on beefy18.nyi.freebsd.org);
	Wed, 07 Oct 2026 05:23:29 +0000
To: elastic@FreeBSD.org
Subject: [package - 144i386-default][textproc/py-elasticsearch-curator] Failed for py312-elasticsearch-curator-5.8.4_2 in configure
Cc: pkg-fallout@FreeBSD.org
Date: Wed, 07 Oct 2026 05:23:29 +0000
Message-Id: <6ac5d751.3d8f.47f51a3f@beefy18.nyi.freebsd.org>
From: <pkg-fallout@FreeBSD.org>
List-Id: Support of ElasticSearch-related ports <freebsd-elastic.freebsd.org>
List-Archive: https://lists.freebsd.org/archives/freebsd-elastic
List-Help: <mailto:freebsd-elastic+help@freebsd.org>
List-Post: <mailto:freebsd-elastic@freebsd.org>
List-Subscribe: <mailto:freebsd-elastic+subscribe@freebsd.org>
List-Unsubscribe: <mailto:freebsd-elastic+unsubscribe@freebsd.org>
Sender: owner-freebsd-elastic@FreeBSD.org
List-Id: <freebsd-elastic.FreeBSD.org>
List-Post: <mailto:freebsd-elastic@FreeBSD.org>
List-Help: <mailto:freebsd-elastic+help@FreeBSD.org>
List-Subscribe: <mailto:freebsd-elastic+subscribe@FreeBSD.org>
List-Unsubscribe: <mailto:freebsd-elastic+unsubscribe@FreeBSD.org>
List-Owner: <mailto:postmaster@FreeBSD.org>
Precedence: list

You are receiving this mail as a port that you maintain
is failing to build on the FreeBSD package build server.
Please investigate the failure and submit a PR to fix
build.

Maintainer:     elastic@FreeBSD.org
Log URL:        https://pkg-status.freebsd.org/beefy18/data/144i386-default/0b23c55e5d2c/logs/py312-elasticsearch-curator-5.8.4_2.log
Build URL:      https://pkg-status.freebsd.org/beefy18/build.html?mastername=144i386-default&build=0b23c55e5d2c
Log:

=>> Building textproc/py-elasticsearch-curator
build started at Wed Oct  7 05:23:23 UTC 2026
port directory: /usr/ports/textproc/py-elasticsearch-curator
package name: py312-elasticsearch-curator-5.8.4_2
building for: FreeBSD 144i386-default-job-04 14.4-RELEASE-p10 FreeBSD 14.4-RELEASE-p10 i386
maintained by: elastic@FreeBSD.org
Makefile datestamp: -rw-r--r--  1 root wheel 1203 Mar 13  2025 /usr/ports/textproc/py-elasticsearch-curator/Makefile
Ports top last git commit: 0b23c55e5d2cdcb4a5d8d11bfc2f9c56cc6348ab
Ports top unclean checkout: no
Port dir last git commit: 06a08e69f3acb846ad8252945f53c3a2d211e303
Port dir unclean checkout: no
Poudriere version: poudriere-git-3.4.8-3-gd92fb7c0
Host OSVERSION: 1600022
Jail OSVERSION: 1404000
Job Id: 04

---Begin Environment---
SHELL=/bin/sh
BLOCKSIZE=K
MAIL=/var/mail/root
MM_CHARSET=UTF-8
LANG=C.UTF-8
OSVERSION=1404000
STATUS=1
HOME=/root
PATH=/sbin:/bin:/usr/sbin:/usr/bin:/usr/local/sbin:/usr/local/bin:/root/bin
MAKE_OBJDIR_CHECK_WRITABLE=0
UNAME_m=i386
UNAME_p=i386
UNAME_r=14.4-RELEASE-p10
LOCALBASE=/usr/local
UNAME_v=FreeBSD 14.4-RELEASE-p10
USER=root
POUDRIERE_NAME=poudriere-git
LIBEXECPREFIX=/usr/local/libexec/poudriere
POUDRIERE_VERSION=3.4.8-3-gd92fb7c0
MASTERMNT=/usr/local/poudriere/data/.m/144i386-default/ref
LC_COLLATE=C
POUDRIERE_BUILD_TYPE=bulk
PACKAGE_BUILDING=yes
SAVED_TERM=
OUTPUT_REDIRECTED_STDERR=4
OUTPUT_REDIRECTED=1
PWD=/usr/local/poudriere/data/.m/144i386-default/04/.p
OUTPUT_REDIRECTED_STDOUT=3
P_PORTS_FEATURES=FLAVORS SUBPACKAGES SELECTED_OPTIONS
MASTERNAME=144i386-default
SCRIPTPREFIX=/usr/local/share/poudriere
SCRIPTNAME=bulk.sh
OLDPWD=/usr/local/poudriere/data/.m/144i386-default/ref/.p/pool
POUDRIERE_PKGNAME=poudriere-git-3.4.8-3-gd92fb7c0
SCRIPTPATH=/usr/local/share/poudriere/bulk.sh
POUDRIEREPATH=/usr/local/bin/poudriere
---End Environment---

---Begin Poudriere Port Flags/Env---
PORT_FLAGS=
PKGENV=
FLAVOR=py312
MAKE_ARGS= FLAVOR=py312
---End Poudriere Port Flags/Env---

---Begin OPTIONS List---
---End OPTIONS List---

--MAINTAINER--
elastic@FreeBSD.org
--End MAINTAINER--

--CONFIGURE_ARGS--

--End CONFIGURE_ARGS--

--CONFIGURE_ENV--
PYTHON="/usr/local/bin/python3.12" XDG_DATA_HOME=/wrkdirs/usr/ports/textproc/py-elasticsearch-curator/work-py312  XDG_CONFIG_HOME=/wrkdirs/usr/ports/textproc/py-elasticsearch-curator/work-py312  XDG_CACHE_HOME=/wrkdirs/usr/ports/textproc/py-elasticsearch-curator/work-py312/.cache  HOME=/wrkdirs/usr/ports/textproc/py-elasticsearch-curator/work-py312 TMPDIR="/tmp" PATH=/wrkdirs/usr/ports/textproc/py-elasticsearch-curator/work-py312/.bin:/sbin:/bin:/usr/sbin:/usr/bin:/usr/local/sbin:/usr/local/bin:/root/bin PKG_CONFIG_LIBDIR=/wrkdirs/usr/ports/textproc/py-elasticsearch-curator/work-py312/.pkgconfig:/usr/local/libdata/pkgconfig:/usr/local/share/pkgconfig:/usr/libdata/pkgconfig SHELL=/bin/sh CONFIG_SHELL=/bin/sh
--End CONFIGURE_ENV--

--MAKE_ENV--
XDG_DATA_HOME=/wrkdirs/usr/ports/textproc/py-elasticsearch-curator/work-py312  XDG_CONFIG_HOME=/wrkdirs/usr/ports/textproc/py-elasticsearch-curator/work-py312  XDG_CACHE_HOME=/wrkdirs/usr/ports/textproc/py-elasticsearch-curator/work-py312/.cache  HOME=/wrkdirs/usr/ports/textproc/py-elasticsearch-curator/work-py312 TMPDIR="/tmp" PATH=/wrkdirs/usr/ports/textproc/py-elasticsearch-curator/work-py312/.bin:/sbin:/bin:/usr/sbin:/usr/bin:/usr/local/sbin:/usr/local/bin:/root/bin PKG_CONFIG_LIBDIR=/wrkdirs/usr/ports/textproc/py-elasticsearch-curator/work-py312/.pkgconfig:/usr/local/libdata/pkgconfig:/usr/local/share/pkgconfig:/usr/libdata/pkgconfig MK_DEBUG_FILES=no MK_KERNEL_SYMBOLS=no SHELL=/bin/sh NO_LINT=YES LDSHARED="cc -shared" PYTHONDONTWRITEBYTECODE= PYTHONOPTIMIZE= PREFIX=/usr/local  LOCALBASE=/usr/local  CC="cc" CFLAGS="-O2 -pipe  -fstack-protector-strong -fno-strict-aliasing "  CPP="cpp" CPPFLAGS=""  LDFLAGS=" " LIBS=""  CXX="c++" CXXFLAGS="-O2 -pipe -fstack-protector-stron
g -fno-strict-aliasing  " BSD_INSTALL_PROGRAM="install  -s -m 555"  BSD_INSTALL_LIB="install  -s -m 0644"  BSD_INSTALL_SCRIPT="install  -m 555"  BSD_INSTALL_DATA="install  -m 0644"  BSD_INSTALL_MAN="install  -m 444"
--End MAKE_ENV--

--PLIST_SUB--
PYTHON_INCLUDEDIR=include/python3.12  PYTHON_LIBDIR=lib/python3.12  PYTHON_PLATFORM=freebsd14  PYTHON_SITELIBDIR=lib/python3.12/site-packages  PYTHON_SUFFIX=312  PYTHON_BASESUFFIX=312  PYTHON_TAG=.cpython-312  PYTHON_SOABI=.cpython-312  PYTHON_VER=3.12  PYTHON_BASEVER=3.12  PYTHON_VERSION=python3.12 PYTHON2="@comment " PYTHON3="" OSREL=14.4 PREFIX=%D LOCALBASE=/usr/local  RESETPREFIX=/usr/local LIB32DIR=lib DOCSDIR="share/doc/elasticsearch-curator"  EXAMPLESDIR="share/examples/elasticsearch-curator"  DATADIR="share/elasticsearch-curator"  WWWDIR="www/elasticsearch-curator"  ETCDIR="etc/elasticsearch-curator"
--End PLIST_SUB--

--SUB_LIST--
PYTHON_INCLUDEDIR=/usr/local/include/python3.12  PYTHON_LIBDIR=/usr/local/lib/python3.12  PYTHON_PLATFORM=freebsd14  PYTHON_SITELIBDIR=/usr/local/lib/python3.12/site-packages  PYTHON_SUFFIX=312  PYTHON_BASESUFFIX=312  PYTHON_TAG=.cpython-312  PYTHON_SOABI=.cpython-312  PYTHON_VER=3.12  PYTHON_BASEVER=3.12  PYTHON_VERSION=python3.12 PYTHON2="@comment " PYTHON3="" PREFIX=/usr/local LOCALBASE=/usr/local  DATADIR=/usr/local/share/elasticsearch-curator DOCSDIR=/usr/local/share/doc/elasticsearch-curator EXAMPLESDIR=/usr/local/share/examples/elasticsearch-curator  WWWDIR=/usr/local/www/elasticsearch-curator ETCDIR=/usr/local/etc/elasticsearch-curator
--End SUB_LIST--

---Begin make.conf---
USE_PACKAGE_DEPENDS=yes
BATCH=yes
WRKDIRPREFIX=/wrkdirs
PORTSDIR=/usr/ports
PACKAGES=/packages
DISTDIR=/distfiles
PACKAGE_BUILDING=yes
PACKAGE_BUILDING_FLAVORS=yes
MACHINE=i386
MACHINE_ARCH=i386
ARCH=${MACHINE_ARCH}
####  ####
# XXX: We really need this but cannot use it while 'make checksum' does not
# try the next mirror on checksum failure.  It currently retries the same
# failed mirror and then fails rather then trying another.  It *does*
# try the next if the size is mismatched though.
#MASTER_SITE_FREEBSD=yes
# Build ALLOW_MAKE_JOBS_PACKAGES with 3 jobs
MAKE_JOBS_NUMBER=3
#### Misc Poudriere ####
.include "/etc/make.conf.ports_env"
GID=0
UID=0
---End make.conf---
--Resource limits--
cpu time               (seconds, -t)  unlimited
file size           (512-blocks, -f)  unlimited
data seg size           (kbytes, -d)  524288
stack size              (kbytes, -s)  65536
core file size      (512-blocks, -c)  unlimited
max memory size         (kbytes, -m)  unlimited
locked memory           (kbytes, -l)  unlimited
max user processes              (-u)  89999
open files                      (-n)  8192
virtual mem size        (kbytes, -v)  unlimited
swap limit              (kbytes, -w)  unlimited
socket buffer size       (bytes, -b)  unlimited
pseudo-terminals                (-p)  unlimited
kqueues                         (-k)  unlimited
umtx shared locks               (-o)  unlimited
pipebuf                         (-y)  unlimited
--End resource limits--
=======================<phase: check-sanity   >============================
===== env: NO_DEPENDS=yes USER=root UID=0 GID=0
===>  License APACHE20 accepted by the user
===========================================================================
=======================<phase: pkg-depends    >============================
===== env: USE_PACKAGE_DEPENDS_ONLY=1 USER=root UID=0 GID=0
===>   py312-elasticsearch-curator-5.8.4_2 depends on file: /usr/local/sbin/pkg - not found
===>   Installing existing package /packages/All/pkg-2.8.4.pkg
[144i386-default-job-04] Installing pkg-2.8.4...
[144i386-default-job-04] Extracting pkg-2.8.4: .......... done
===>   py312-elasticsearch-curator-5.8.4_2 depends on file: /usr/local/sbin/pkg - found
===>   Returning to build of py312-elasticsearch-curator-5.8.4_2
===========================================================================
=======================<phase: fetch-depends  >============================
===== env: USE_PACKAGE_DEPENDS_ONLY=1 USER=root UID=0 GID=0
===========================================================================
=======================<phase: fetch          >============================
===== env: NO_DEPENDS=yes USER=root UID=0 GID=0
===>  License APACHE20 accepted by the user
===> Fetching all distfiles required by py312-elasticsearch-curator-5.8.4_2 for building
===========================================================================
=======================<phase: checksum       >============================
===== env: NO_DEPENDS=yes USER=root UID=0 GID=0
===>  License APACHE20 accepted by the user
===> Fetching all distfiles required by py312-elasticsearch-curator-5.8.4_2 for building
=> SHA256 Checksum OK for elastic-curator-v5.8.4_GH0.tar.gz.
===========================================================================
=======================<phase: extract-depends>============================
===== env: USE_PACKAGE_DEPENDS_ONLY=1 USER=root UID=0 GID=0
===========================================================================
=======================<phase: extract        >============================
===== env: NO_DEPENDS=yes USER=root UID=0 GID=0
===>  License APACHE20 accepted by the user
===> Fetching all distfiles required by py312-elasticsearch-curator-5.8.4_2 for building
===>  Extracting for py312-elasticsearch-curator-5.8.4_2
=> SHA256 Checksum OK for elastic-curator-v5.8.4_GH0.tar.gz.
===========================================================================
=======================<phase: patch-depends  >============================
===== env: USE_PACKAGE_DEPENDS_ONLY=1 USER=root UID=0 GID=0
===========================================================================
=======================<phase: patch          >============================
===== env: NO_DEPENDS=yes USER=root UID=0 GID=0
===>  Patching for py312-elasticsearch-curator-5.8.4_2
===>  Applying FreeBSD patches for py312-elasticsearch-curator-5.8.4_2 from /usr/ports/textproc/py-elasticsearch-curator/files
===========================================================================
=======================<phase: build-depends  >============================
===== env: USE_PACKAGE_DEPENDS_ONLY=1 USER=root UID=0 GID=0
===>   py312-elasticsearch-curator-5.8.4_2 depends on package: py312-boto3>=1.7.24 - not found
===>   Installing existing package /packages/All/py312-boto3-1.43.99.pkg
[144i386-default-job-04] Installing py312-boto3-1.43.99...
[144i386-default-job-04] `-- Installing py312-botocore-1.43.99...
[144i386-default-job-04] |   `-- Installing py312-jmespath-1.1.0...
[144i386-default-job-04] |   | `-- Installing python312-3.12.14_1...
[144i386-default-job-04] |   |   `-- Installing expat-2.8.5...
[144i386-default-job-04] |   |   `-- Extracting expat-2.8.5: .......... done
[144i386-default-job-04] |   |   `-- Installing gettext-runtime-1.0_1...
[144i386-default-job-04] |   |   | `-- Installing indexinfo-0.3.1_1...
[144i386-default-job-04] |   |   | `-- Extracting indexinfo-0.3.1_1: .... done
[144i386-default-job-04] |   |   `-- Extracting gettext-runtime-1.0_1: .......... done
[144i386-default-job-04] |   |   `-- Installing libffi-3.8.0...
[144i386-default-job-04] |   |   `-- Extracting libffi-3.8.0: .......... done
[144i386-default-job-04] |   |   `-- Installing mpdecimal-4.0.1...
[144i386-default-job-04] |   |   `-- Extracting mpdecimal-4.0.1: .......... done
[144i386-default-job-04] |   |   `-- Installing readline-8.3.6...
[144i386-default-job-04] |   |   `-- Extracting readline-8.3.6: .......... done
[144i386-default-job-04] |   | `-- Extracting python312-3.12.14_1: .......... done
[144i386-default-job-04] |   `-- Extracting py312-jmespath-1.1.0: .......... done
[144i386-default-job-04] |   `-- Installing py312-python-dateutil-2.9.0...
[144i386-default-job-04] |   | `-- Installing py312-six-1.17.0...
[144i386-default-job-04] |   | `-- Extracting py312-six-1.17.0: .......... done
[144i386-default-job-04] |   `-- Extracting py312-python-dateutil-2.9.0: .......... done
[144i386-default-job-04] |   `-- Installing py312-urllib3-2.8.0,1...
[144i386-default-job-04] |   | `-- Installing py312-pysocks-1.7.1_1...
[144i386-default-job-04] |   | `-- Extracting py312-pysocks-1.7.1_1: .......... done
[144i386-default-job-04] |   `-- Extracting py312-urllib3-2.8.0,1: .......... done
[144i386-default-job-04] `-- Extracting py312-botocore-1.43.99: .......... done
[144i386-default-job-04] `-- Installing py312-s3transfer-0.19.2...
[144i386-default-job-04] `-- Extracting py312-s3transfer-0.19.2: .......... done
[144i386-default-job-04] Extracting py312-boto3-1.43.99: .......... done
=====
Message from python312-3.12.14_1:

--
Note that some standard Python modules are provided as separate ports
as they require additional dependencies. They are available as:

py312-gdbm       databases/py-gdbm@py312
py312-sqlite3    databases/py-sqlite3@py312
py312-tkinter    x11-toolkits/py-tkinter@py312
=====
Message from py312-urllib3-2.8.0,1:

--
Since version 1.25 HTTPS connections are now verified by default which is done
via "cert_reqs = 'CERT_REQUIRED'".  While certificate verification can be
disabled via "cert_reqs = 'CERT_NONE'", it's highly recommended to leave it on.

Various consumers of net/py-urllib3 already have implemented routines that
either explicitly enable or disable HTTPS certificate verification (e.g. via
configuration settings, CLI arguments, etc.).

Yet it may happen that there are still some consumers which don't explicitly
enable/disable certificate verification for HTTPS connections which could then
lead to errors (as is often the case with self-signed certificates).

In case of an error one should try first to temporarily disable certificate
verification of the problematic urllib3 consumer to see if that approach will
remedy the issue.
===>   py312-elasticsearch-curator-5.8.4_2 depends on package: py312-boto3>=1.7.24 - found
===>   Returning to build of py312-elasticsearch-curator-5.8.4_2
===>   py312-elasticsearch-curator-5.8.4_2 depends on package: py312-certifi>=2018.10.15 - not found
===>   Installing existing package /packages/All/py312-certifi-2026.7.22.pkg
[144i386-default-job-04] Installing py312-certifi-2026.7.22...
[144i386-default-job-04] Extracting py312-certifi-2026.7.22: .......... done
===>   py312-elasticsearch-curator-5.8.4_2 depends on package: py312-certifi>=2018.10.15 - found
===>   Returning to build of py312-elasticsearch-curator-5.8.4_2
===>   py312-elasticsearch-curator-5.8.4_2 depends on package: py312-click7>=7.1.2 - not found
===>   Installing existing package /packages/All/py312-click7-7.1.2_1.pkg
[144i386-default-job-04] Installing py312-click7-7.1.2_1...
[144i386-default-job-04] Extracting py312-click7-7.1.2_1: .......... done
===>   py312-elasticsearch-curator-5.8.4_2 depends on package: py312-click7>=7.1.2 - found
===>   Returning to build of py312-elasticsearch-curator-5.8.4_2
===>   py312-elasticsearch-curator-5.8.4_2 depends on package: py312-elasticsearch>=7.15.1 - not found
===>   Installing existing package /packages/All/py312-elasticsearch-9.5.1.pkg
[144i386-default-job-04] Installing py312-elasticsearch-9.5.1...
[144i386-default-job-04] `-- Installing py312-anyio-4.15.1...
[144i386-default-job-04] |   `-- Installing py312-idna-3.20...
[144i386-default-job-04] |   `-- Extracting py312-idna-3.20: .......... done
[144i386-default-job-04] |   `-- Installing py312-truststore-0.10.4_1...
[144i386-default-job-04] |   `-- Extracting py312-truststore-0.10.4_1: .......... done
[144i386-default-job-04] |   `-- Installing py312-typing-extensions-4.16.0...
[144i386-default-job-04] |   `-- Extracting py312-typing-extensions-4.16.0: .......... done
[144i386-default-job-04] `-- Extracting py312-anyio-4.15.1: .......... done
[144i386-default-job-04] `-- Installing py312-elastic-transport-9.4.2...
[144i386-default-job-04] |   `-- Installing py312-sniffio-1.3.1...
[144i386-default-job-04] |   `-- Extracting py312-sniffio-1.3.1: .......... done
[144i386-default-job-04] `-- Extracting py312-elastic-transport-9.4.2: .......... done
[144i386-default-job-04] `-- Installing py312-requests-2.34.2...
[144i386-default-job-04] |   `-- Installing py312-charset-normalizer-3.5.1...
[144i386-default-job-04] |   `-- Extracting py312-charset-normalizer-3.5.1: .......... done
[144i386-default-job-04] `-- Extracting py312-requests-2.34.2: .......... done
[144i386-default-job-04] Extracting py312-elasticsearch-9.5.1: .......... done
===>   py312-elasticsearch-curator-5.8.4_2 depends on package: py312-elasticsearch>=7.15.1 - found
===>   Returning to build of py312-elasticsearch-curator-5.8.4_2
===>   py312-elasticsearch-curator-5.8.4_2 depends on package: py312-requests-aws4auth>=0.9 - not found
===>   Installing existing package /packages/All/py312-requests-aws4auth-1.3.2.pkg
[144i386-default-job-04] Installing py312-requests-aws4auth-1.3.2...
[144i386-default-job-04] Extracting py312-requests-aws4auth-1.3.2: .......... done
===>   py312-elasticsearch-curator-5.8.4_2 depends on package: py312-requests-aws4auth>=0.9 - found
===>   Returning to build of py312-elasticsearch-curator-5.8.4_2
===>   py312-elasticsearch-curator-5.8.4_2 depends on package: py312-six>=1.11.0 - found
===>   py312-elasticsearch-curator-5.8.4_2 depends on package: py312-urllib3>=1.26.4 - found
===>   py312-elasticsearch-curator-5.8.4_2 depends on package: py312-voluptuous>=0.9.3 - not found
===>   Installing existing package /packages/All/py312-voluptuous-0.16.0.pkg
[144i386-default-job-04] Installing py312-voluptuous-0.16.0...
[144i386-default-job-04] Extracting py312-voluptuous-0.16.0: .......... done
===>   py312-elasticsearch-curator-5.8.4_2 depends on package: py312-voluptuous>=0.9.3 - found
===>   Returning to build of py312-elasticsearch-curator-5.8.4_2
===>   py312-elasticsearch-curator-5.8.4_2 depends on package: py312-pyyaml>=3.10 - not found
===>   Installing existing package /packages/All/py312-pyyaml-6.0.3_1.pkg
[144i386-default-job-04] Installing py312-pyyaml-6.0.3_1...
[144i386-default-job-04] `-- Installing libyaml-0.2.5...
[144i386-default-job-04] `-- Extracting libyaml-0.2.5: ......... done
[144i386-default-job-04] Extracting py312-pyyaml-6.0.3_1: .......... done
===>   py312-elasticsearch-curator-5.8.4_2 depends on package: py312-pyyaml>=3.10 - found
===>   Returning to build of py312-elasticsearch-curator-5.8.4_2
===>   py312-elasticsearch-curator-5.8.4_2 depends on file: /usr/local/bin/python3.12 - found
===>   py312-elasticsearch-curator-5.8.4_2 depends on package: py312-setuptools>=63.1.0 - not found
===>   Installing existing package /packages/All/py312-setuptools-63.1.0_3.pkg
[144i386-default-job-04] Installing py312-setuptools-63.1.0_3...
[144i386-default-job-04] Extracting py312-setuptools-63.1.0_3: .......... done
===>   py312-elasticsearch-curator-5.8.4_2 depends on package: py312-setuptools>=63.1.0 - found
===>   Returning to build of py312-elasticsearch-curator-5.8.4_2
===>   py312-elasticsearch-curator-5.8.4_2 depends on file: /usr/local/bin/python3.12 - found
===========================================================================
=======================<phase: lib-depends    >============================
===== env: USE_PACKAGE_DEPENDS_ONLY=1 USER=root UID=0 GID=0
===========================================================================
=======================<phase: configure      >============================
===== env: NO_DEPENDS=yes USER=root UID=0 GID=0
===>  Configuring for py312-elasticsearch-curator-5.8.4_2
/usr/local/lib/python3.12/site-packages/setuptools/installer.py:27: SetuptoolsDeprecationWarning: setuptools.installer is deprecated. Requirements should be satisfied by a PEP 517 installer.
  warnings.warn(
WARNING: The wheel package is not available.
/usr/local/bin/python3.12: No module named pip
Traceback (most recent call last):
  File "setup.py", line 39, in <module>
    from cx_Freeze import setup, Executable
ModuleNotFoundError: No module named 'cx_Freeze'

During handling of the above exception, another exception occurred:

Traceback (most recent call last):
  File "/usr/local/lib/python3.12/site-packages/setuptools/installer.py", line 82, in fetch_build_egg
    subprocess.check_call(cmd)
  File "/usr/local/lib/python3.12/subprocess.py", line 413, in check_call
    raise CalledProcessError(retcode, cmd)
subprocess.CalledProcessError: Command '['/usr/local/bin/python3.12', '-m', 'pip', '--disable-pip-version-check', 'wheel', '--no-deps', '-w', '/tmp/tmpbv1zc5m9', '--quiet', 'elasticsearch<8.0.0,>=7.12.0']' returned non-zero exit status 1.

The above exception was the direct cause of the following exception:

Traceback (most recent call last):
  File "<string>", line 1, in <module>
  File "setup.py", line 144, in <module>
    setup(
  File "/usr/local/lib/python3.12/site-packages/setuptools/__init__.py", line 86, in setup
    _install_setup_requires(attrs)
  File "/usr/local/lib/python3.12/site-packages/setuptools/__init__.py", line 80, in _install_setup_requires
    dist.fetch_build_eggs(dist.setup_requires)
  File "/usr/local/lib/python3.12/site-packages/setuptools/dist.py", line 875, in fetch_build_eggs
    resolved_dists = pkg_resources.working_set.resolve(
                     ^^^^^^^^^^^^^^^^^^^^^^^^^^^^^^^^^^
  File "/usr/local/lib/python3.12/site-packages/pkg_resources/__init__.py", line 789, in resolve
    dist = best[req.key] = env.best_match(
                           ^^^^^^^^^^^^^^^
  File "/usr/local/lib/python3.12/site-packages/pkg_resources/__init__.py", line 1075, in best_match
    return self.obtain(req, installer)
           ^^^^^^^^^^^^^^^^^^^^^^^^^^^
  File "/usr/local/lib/python3.12/site-packages/pkg_resources/__init__.py", line 1087, in obtain
    return installer(requirement)
           ^^^^^^^^^^^^^^^^^^^^^^
  File "/usr/local/lib/python3.12/site-packages/setuptools/dist.py", line 945, in fetch_build_egg
    return fetch_build_egg(self, req)
           ^^^^^^^^^^^^^^^^^^^^^^^^^^
  File "/usr/local/lib/python3.12/site-packages/setuptools/installer.py", line 84, in fetch_build_egg
    raise DistutilsError(str(e)) from e
distutils.errors.DistutilsError: Command '['/usr/local/bin/python3.12', '-m', 'pip', '--disable-pip-version-check', 'wheel', '--no-deps', '-w', '/tmp/tmpbv1zc5m9', '--quiet', 'elasticsearch<8.0.0,>=7.12.0']' returned non-zero exit status 1.
*** Error code 1

Stop.
make: stopped making "configure" in /usr/ports/textproc/py-elasticsearch-curator

From nobody Wed Oct  7 16:12:38 2026
X-Original-To: elastic@mlmmj.nyi.freebsd.org
Received: from mx1.freebsd.org (mx1.freebsd.org [IPv6:2610:1c1:1:606c::19:1])
	by mlmmj.nyi.freebsd.org (Postfix) with ESMTP id 4j0J7B4l5lz6w6x3
	for <elastic@mlmmj.nyi.freebsd.org>; Wed, 07 Oct 2026 16:12:38 +0000 (UTC)
	(envelope-from pkg-fallout@FreeBSD.org)
Received: from mxrelay.nyi.freebsd.org (mxrelay.nyi.freebsd.org [IPv6:2610:1c1:1:606c::19:3])
	(using TLSv1.3 with cipher TLS_AES_256_GCM_SHA384 (256/256 bits)
	 key-exchange x25519 server-signature RSA-PSS (4096 bits) server-digest SHA256
	 client-signature RSA-PSS (4096 bits) client-digest SHA256)
	(Client CN "mxrelay.nyi.freebsd.org", Issuer "YR2" (not verified))
	by mx1.freebsd.org (Postfix) with ESMTPS id 4j0J7B2B6hz4Sqc
	for <elastic@FreeBSD.org>; Wed, 07 Oct 2026 16:12:38 +0000 (UTC)
	(envelope-from pkg-fallout@FreeBSD.org)
ARC-Seal: i=1; a=rsa-sha256; d=freebsd.org; s=dkim; cv=none; t=1791389558;
	b=ZK8LV9V+L1DYpz756WdY7h8rUVfzYipWcNdU92DqqNUbcDOrR3k0vmUQADWn7vSxdUBa4f
	TM33qAfWAna8gM1CU8tADkn5NPHGPFaDLFneRx7PNwssV2ZjFaJJ8W1FEZARS5Q0VjC3OS
	fucZnAyujc/TlkZNFV3H5rOQzMaq7Iu4GXVyxpOflwtZlhj6b2Mzo4Z/IZALA/YjF28ZSY
	Gqz2LGxwf/xDWOrjyWDROsBVUH3qFnUt2pbfL5dDFtpi2ud7jNLXxCyQgOxwZXqE0/bfO1
	ePWDBfU0C29HgTU4iahaE3FyUb6ak0O9VyDMv1zkNu+RS6sFkIS9vK+qs7NXiQ==
ARC-Message-Signature: i=1; a=rsa-sha256; c=relaxed/relaxed; d=freebsd.org;
	s=dkim; t=1791389558;
	h=from:from:reply-to:subject:subject:date:date:message-id:message-id:
	 to:to:cc:cc; bh=ga6vHcfzsQVI3sbihemlZCmFYR1hGARelYwHPMA7+Po=;
	b=XPPXKm3tiFRtO8mRZC+DBGaOzUYqgdtnpGwilz0XG0hrzgZustf/DbieglA8uNzJkLV4vZ
	q+LCFkdB0eN6ECIaBUftN/5BSWJU6gvTKvcnUiWJsid+WFwAO3u0NJco3XPMbGwOpygtr1
	ccR7Pt1ojtd+6EtCnIwmG5tcXnuWl+3CYJr7YkSy/g1C/vAcYFbMbeXyHXHCCcECJSuAGH
	7qde1Lw/ax/MOeTB1A1j0A0Wqfy/yNKctrApHsBdATRjW+3hCVKxBNEc+SQP972GBwCSe2
	DzBWLzU5VH4hrNH29xumsumS+dqnweNkvZfB1/dzfhuWU0sdXQXFbP4GcQoL9A==
ARC-Authentication-Results: i=1;
	mx1.freebsd.org;
	none
Received: from ampere3.nyi.freebsd.org (ampere3.nyi.freebsd.org [IPv6:2610:1c1:1:6080::16:26])
	by mxrelay.nyi.freebsd.org (Postfix) with ESMTP id 4j0J7B0ztPz119q
	for <elastic@FreeBSD.org>; Wed, 07 Oct 2026 16:12:38 +0000 (UTC)
	(envelope-from pkg-fallout@FreeBSD.org)
Received: from root (uid 0)
	(envelope-from pkg-fallout@FreeBSD.org)
	id 28e3
	by ampere3.nyi.freebsd.org (DragonFly Mail Agent v0.13+ on ampere3.nyi.freebsd.org);
	Wed, 07 Oct 2026 16:12:38 +0000
To: elastic@FreeBSD.org
Subject: [package - 144arm64-default][textproc/py-elasticsearch-curator] Failed for py312-elasticsearch-curator-5.8.4_2 in configure
Cc: pkg-fallout@FreeBSD.org
Date: Wed, 07 Oct 2026 16:12:38 +0000
Message-Id: <6ac66f76.28e3.7bc6d2a8@ampere3.nyi.freebsd.org>
From: <pkg-fallout@FreeBSD.org>
List-Id: Support of ElasticSearch-related ports <freebsd-elastic.freebsd.org>
List-Archive: https://lists.freebsd.org/archives/freebsd-elastic
List-Help: <mailto:freebsd-elastic+help@freebsd.org>
List-Post: <mailto:freebsd-elastic@freebsd.org>
List-Subscribe: <mailto:freebsd-elastic+subscribe@freebsd.org>
List-Unsubscribe: <mailto:freebsd-elastic+unsubscribe@freebsd.org>
Sender: owner-freebsd-elastic@FreeBSD.org
List-Id: <freebsd-elastic.FreeBSD.org>
List-Post: <mailto:freebsd-elastic@FreeBSD.org>
List-Help: <mailto:freebsd-elastic+help@FreeBSD.org>
List-Subscribe: <mailto:freebsd-elastic+subscribe@FreeBSD.org>
List-Unsubscribe: <mailto:freebsd-elastic+unsubscribe@FreeBSD.org>
List-Owner: <mailto:postmaster@FreeBSD.org>
Precedence: list

You are receiving this mail as a port that you maintain
is failing to build on the FreeBSD package build server.
Please investigate the failure and submit a PR to fix
build.

Maintainer:     elastic@FreeBSD.org
Log URL:        https://pkg-status.freebsd.org/ampere3/data/144arm64-default/28a1681357b6/logs/py312-elasticsearch-curator-5.8.4_2.log
Build URL:      https://pkg-status.freebsd.org/ampere3/build.html?mastername=144arm64-default&build=28a1681357b6
Log:

=>> Building textproc/py-elasticsearch-curator
build started at Wed Oct  7 16:12:27 UTC 2026
port directory: /usr/ports/textproc/py-elasticsearch-curator
package name: py312-elasticsearch-curator-5.8.4_2
building for: FreeBSD 144arm64-default-job-08 14.4-RELEASE-p10 FreeBSD 14.4-RELEASE-p10 arm64
maintained by: elastic@FreeBSD.org
Makefile datestamp: -rw-r--r--  1 root wheel 1203 Mar 15  2025 /usr/ports/textproc/py-elasticsearch-curator/Makefile
Ports top last git commit: 28a1681357b67b5777b6ff6ce13eb199b0180597
Ports top unclean checkout: no
Port dir last git commit: 06a08e69f3acb846ad8252945f53c3a2d211e303
Port dir unclean checkout: no
Poudriere version: poudriere-git-3.4.8-3-gd92fb7c0
Host OSVERSION: 1600022
Jail OSVERSION: 1404000
Job Id: 08

---Begin Environment---
SHELL=/bin/sh
OSVERSION=1404000
UNAME_v=FreeBSD 14.4-RELEASE-p10
UNAME_r=14.4-RELEASE-p10
BLOCKSIZE=K
MAIL=/var/mail/root
MM_CHARSET=UTF-8
LANG=C.UTF-8
STATUS=1
HOME=/root
PATH=/sbin:/bin:/usr/sbin:/usr/bin:/usr/local/sbin:/usr/local/bin:/root/bin
MAKE_OBJDIR_CHECK_WRITABLE=0
LOCALBASE=/usr/local
USER=root
POUDRIERE_NAME=poudriere-git
LIBEXECPREFIX=/usr/local/libexec/poudriere
POUDRIERE_VERSION=3.4.8-3-gd92fb7c0
MASTERMNT=/usr/local/poudriere/data/.m/144arm64-default/ref
LC_COLLATE=C
POUDRIERE_BUILD_TYPE=bulk
PACKAGE_BUILDING=yes
SAVED_TERM=
OUTPUT_REDIRECTED_STDERR=4
OUTPUT_REDIRECTED=1
PWD=/usr/local/poudriere/data/.m/144arm64-default/08/.p
OUTPUT_REDIRECTED_STDOUT=3
P_PORTS_FEATURES=FLAVORS SUBPACKAGES SELECTED_OPTIONS
MASTERNAME=144arm64-default
SCRIPTPREFIX=/usr/local/share/poudriere
SCRIPTNAME=bulk.sh
OLDPWD=/usr/local/poudriere/data/.m/144arm64-default/ref/.p/pool
POUDRIERE_PKGNAME=poudriere-git-3.4.8-3-gd92fb7c0
SCRIPTPATH=/usr/local/share/poudriere/bulk.sh
POUDRIEREPATH=/usr/local/bin/poudriere
---End Environment---

---Begin Poudriere Port Flags/Env---
PORT_FLAGS=
PKGENV=
FLAVOR=py312
MAKE_ARGS= FLAVOR=py312
---End Poudriere Port Flags/Env---

---Begin OPTIONS List---
---End OPTIONS List---

--MAINTAINER--
elastic@FreeBSD.org
--End MAINTAINER--

--CONFIGURE_ARGS--

--End CONFIGURE_ARGS--

--CONFIGURE_ENV--
PYTHON="/usr/local/bin/python3.12" XDG_DATA_HOME=/wrkdirs/usr/ports/textproc/py-elasticsearch-curator/work-py312  XDG_CONFIG_HOME=/wrkdirs/usr/ports/textproc/py-elasticsearch-curator/work-py312  XDG_CACHE_HOME=/wrkdirs/usr/ports/textproc/py-elasticsearch-curator/work-py312/.cache  HOME=/wrkdirs/usr/ports/textproc/py-elasticsearch-curator/work-py312 TMPDIR="/tmp" PATH=/wrkdirs/usr/ports/textproc/py-elasticsearch-curator/work-py312/.bin:/sbin:/bin:/usr/sbin:/usr/bin:/usr/local/sbin:/usr/local/bin:/root/bin PKG_CONFIG_LIBDIR=/wrkdirs/usr/ports/textproc/py-elasticsearch-curator/work-py312/.pkgconfig:/usr/local/libdata/pkgconfig:/usr/local/share/pkgconfig:/usr/libdata/pkgconfig SHELL=/bin/sh CONFIG_SHELL=/bin/sh
--End CONFIGURE_ENV--

--MAKE_ENV--
XDG_DATA_HOME=/wrkdirs/usr/ports/textproc/py-elasticsearch-curator/work-py312  XDG_CONFIG_HOME=/wrkdirs/usr/ports/textproc/py-elasticsearch-curator/work-py312  XDG_CACHE_HOME=/wrkdirs/usr/ports/textproc/py-elasticsearch-curator/work-py312/.cache  HOME=/wrkdirs/usr/ports/textproc/py-elasticsearch-curator/work-py312 TMPDIR="/tmp" PATH=/wrkdirs/usr/ports/textproc/py-elasticsearch-curator/work-py312/.bin:/sbin:/bin:/usr/sbin:/usr/bin:/usr/local/sbin:/usr/local/bin:/root/bin PKG_CONFIG_LIBDIR=/wrkdirs/usr/ports/textproc/py-elasticsearch-curator/work-py312/.pkgconfig:/usr/local/libdata/pkgconfig:/usr/local/share/pkgconfig:/usr/libdata/pkgconfig MK_DEBUG_FILES=no MK_KERNEL_SYMBOLS=no SHELL=/bin/sh NO_LINT=YES LDSHARED="cc -shared" PYTHONDONTWRITEBYTECODE= PYTHONOPTIMIZE= PREFIX=/usr/local  LOCALBASE=/usr/local  CC="cc" CFLAGS="-O2 -pipe  -fstack-protector-strong -fno-strict-aliasing "  CPP="cpp" CPPFLAGS=""  LDFLAGS=" " LIBS=""  CXX="c++" CXXFLAGS="-O2 -pipe -fstack-protector-stron
g -fno-strict-aliasing  " BSD_INSTALL_PROGRAM="install  -s -m 555"  BSD_INSTALL_LIB="install  -s -m 0644"  BSD_INSTALL_SCRIPT="install  -m 555"  BSD_INSTALL_DATA="install  -m 0644"  BSD_INSTALL_MAN="install  -m 444"
--End MAKE_ENV--

--PLIST_SUB--
PYTHON_INCLUDEDIR=include/python3.12  PYTHON_LIBDIR=lib/python3.12  PYTHON_PLATFORM=freebsd14  PYTHON_SITELIBDIR=lib/python3.12/site-packages  PYTHON_SUFFIX=312  PYTHON_BASESUFFIX=312  PYTHON_TAG=.cpython-312  PYTHON_SOABI=.cpython-312  PYTHON_VER=3.12  PYTHON_BASEVER=3.12  PYTHON_VERSION=python3.12 PYTHON2="@comment " PYTHON3="" OSREL=14.4 PREFIX=%D LOCALBASE=/usr/local  RESETPREFIX=/usr/local LIB32DIR=lib DOCSDIR="share/doc/elasticsearch-curator"  EXAMPLESDIR="share/examples/elasticsearch-curator"  DATADIR="share/elasticsearch-curator"  WWWDIR="www/elasticsearch-curator"  ETCDIR="etc/elasticsearch-curator"
--End PLIST_SUB--

--SUB_LIST--
PYTHON_INCLUDEDIR=/usr/local/include/python3.12  PYTHON_LIBDIR=/usr/local/lib/python3.12  PYTHON_PLATFORM=freebsd14  PYTHON_SITELIBDIR=/usr/local/lib/python3.12/site-packages  PYTHON_SUFFIX=312  PYTHON_BASESUFFIX=312  PYTHON_TAG=.cpython-312  PYTHON_SOABI=.cpython-312  PYTHON_VER=3.12  PYTHON_BASEVER=3.12  PYTHON_VERSION=python3.12 PYTHON2="@comment " PYTHON3="" PREFIX=/usr/local LOCALBASE=/usr/local  DATADIR=/usr/local/share/elasticsearch-curator DOCSDIR=/usr/local/share/doc/elasticsearch-curator EXAMPLESDIR=/usr/local/share/examples/elasticsearch-curator  WWWDIR=/usr/local/www/elasticsearch-curator ETCDIR=/usr/local/etc/elasticsearch-curator
--End SUB_LIST--

---Begin make.conf---
USE_PACKAGE_DEPENDS=yes
BATCH=yes
WRKDIRPREFIX=/wrkdirs
PORTSDIR=/usr/ports
PACKAGES=/packages
DISTDIR=/distfiles
PACKAGE_BUILDING=yes
PACKAGE_BUILDING_FLAVORS=yes
####  ####
# XXX: We really need this but cannot use it while 'make checksum' does not
# try the next mirror on checksum failure.  It currently retries the same
# failed mirror and then fails rather then trying another.  It *does*
# try the next if the size is mismatched though.
#MASTER_SITE_FREEBSD=yes
# Build ALLOW_MAKE_JOBS_PACKAGES with 3 jobs
MAKE_JOBS_NUMBER=3
#### Misc Poudriere ####
.include "/etc/make.conf.ports_env"
GID=0
UID=0
---End make.conf---
--Resource limits--
cpu time               (seconds, -t)  unlimited
file size           (512-blocks, -f)  unlimited
data seg size           (kbytes, -d)  1048576
stack size              (kbytes, -s)  1048576
core file size      (512-blocks, -c)  unlimited
max memory size         (kbytes, -m)  unlimited
locked memory           (kbytes, -l)  unlimited
max user processes              (-u)  89999
open files                      (-n)  8192
virtual mem size        (kbytes, -v)  unlimited
swap limit              (kbytes, -w)  unlimited
socket buffer size       (bytes, -b)  unlimited
pseudo-terminals                (-p)  unlimited
kqueues                         (-k)  unlimited
umtx shared locks               (-o)  unlimited
pipebuf                         (-y)  unlimited
--End resource limits--
=======================<phase: check-sanity   >============================
===== env: NO_DEPENDS=yes USER=root UID=0 GID=0
===>  License APACHE20 accepted by the user
===========================================================================
=======================<phase: pkg-depends    >============================
===== env: USE_PACKAGE_DEPENDS_ONLY=1 USER=root UID=0 GID=0
===>   py312-elasticsearch-curator-5.8.4_2 depends on file: /usr/local/sbin/pkg - not found
===>   Installing existing package /packages/All/pkg-2.8.4.pkg
[144arm64-default-job-08] Installing pkg-2.8.4...
[144arm64-default-job-08] Extracting pkg-2.8.4: .......... done
===>   py312-elasticsearch-curator-5.8.4_2 depends on file: /usr/local/sbin/pkg - found
===>   Returning to build of py312-elasticsearch-curator-5.8.4_2
===========================================================================
=======================<phase: fetch-depends  >============================
===== env: USE_PACKAGE_DEPENDS_ONLY=1 USER=root UID=0 GID=0
===========================================================================
=======================<phase: fetch          >============================
===== env: NO_DEPENDS=yes USER=root UID=0 GID=0
===>  License APACHE20 accepted by the user
===> Fetching all distfiles required by py312-elasticsearch-curator-5.8.4_2 for building
===========================================================================
=======================<phase: checksum       >============================
===== env: NO_DEPENDS=yes USER=root UID=0 GID=0
===>  License APACHE20 accepted by the user
===> Fetching all distfiles required by py312-elasticsearch-curator-5.8.4_2 for building
=> SHA256 Checksum OK for elastic-curator-v5.8.4_GH0.tar.gz.
===========================================================================
=======================<phase: extract-depends>============================
===== env: USE_PACKAGE_DEPENDS_ONLY=1 USER=root UID=0 GID=0
===========================================================================
=======================<phase: extract        >============================
===== env: NO_DEPENDS=yes USER=root UID=0 GID=0
===>  License APACHE20 accepted by the user
===> Fetching all distfiles required by py312-elasticsearch-curator-5.8.4_2 for building
===>  Extracting for py312-elasticsearch-curator-5.8.4_2
=> SHA256 Checksum OK for elastic-curator-v5.8.4_GH0.tar.gz.
===========================================================================
=======================<phase: patch-depends  >============================
===== env: USE_PACKAGE_DEPENDS_ONLY=1 USER=root UID=0 GID=0
===========================================================================
=======================<phase: patch          >============================
===== env: NO_DEPENDS=yes USER=root UID=0 GID=0
===>  Patching for py312-elasticsearch-curator-5.8.4_2
===>  Applying FreeBSD patches for py312-elasticsearch-curator-5.8.4_2 from /usr/ports/textproc/py-elasticsearch-curator/files
===========================================================================
=======================<phase: build-depends  >============================
===== env: USE_PACKAGE_DEPENDS_ONLY=1 USER=root UID=0 GID=0
===>   py312-elasticsearch-curator-5.8.4_2 depends on package: py312-boto3>=1.7.24 - not found
===>   Installing existing package /packages/All/py312-boto3-1.43.99.pkg
[144arm64-default-job-08] Installing py312-boto3-1.43.99...
[144arm64-default-job-08] `-- Installing py312-botocore-1.43.99...
[144arm64-default-job-08] |   `-- Installing py312-jmespath-1.1.0...
[144arm64-default-job-08] |   | `-- Installing python312-3.12.14_1...
[144arm64-default-job-08] |   |   `-- Installing expat-2.8.4...
[144arm64-default-job-08] |   |   `-- Extracting expat-2.8.4: .......... done
[144arm64-default-job-08] |   |   `-- Installing gettext-runtime-1.0_1...
[144arm64-default-job-08] |   |   | `-- Installing indexinfo-0.3.1_1...
[144arm64-default-job-08] |   |   | `-- Extracting indexinfo-0.3.1_1: .... done
[144arm64-default-job-08] |   |   `-- Extracting gettext-runtime-1.0_1: .......... done
[144arm64-default-job-08] |   |   `-- Installing libffi-3.8.0...
[144arm64-default-job-08] |   |   `-- Extracting libffi-3.8.0: .......... done
[144arm64-default-job-08] |   |   `-- Installing mpdecimal-4.0.1...
[144arm64-default-job-08] |   |   `-- Extracting mpdecimal-4.0.1: .......... done
[144arm64-default-job-08] |   |   `-- Installing readline-8.3.6...
[144arm64-default-job-08] |   |   `-- Extracting readline-8.3.6: .......... done
[144arm64-default-job-08] |   | `-- Extracting python312-3.12.14_1: .......... done
[144arm64-default-job-08] |   `-- Extracting py312-jmespath-1.1.0: .......... done
[144arm64-default-job-08] |   `-- Installing py312-python-dateutil-2.9.0...
[144arm64-default-job-08] |   | `-- Installing py312-six-1.17.0...
[144arm64-default-job-08] |   | `-- Extracting py312-six-1.17.0: .......... done
[144arm64-default-job-08] |   `-- Extracting py312-python-dateutil-2.9.0: .......... done
[144arm64-default-job-08] |   `-- Installing py312-urllib3-2.8.0,1...
[144arm64-default-job-08] |   | `-- Installing py312-pysocks-1.7.1_1...
[144arm64-default-job-08] |   | `-- Extracting py312-pysocks-1.7.1_1: .......... done
[144arm64-default-job-08] |   `-- Extracting py312-urllib3-2.8.0,1: .......... done
[144arm64-default-job-08] `-- Extracting py312-botocore-1.43.99: .......... done
[144arm64-default-job-08] `-- Installing py312-s3transfer-0.19.2...
[144arm64-default-job-08] `-- Extracting py312-s3transfer-0.19.2: .......... done
[144arm64-default-job-08] Extracting py312-boto3-1.43.99: .......... done
=====
Message from python312-3.12.14_1:

--
Note that some standard Python modules are provided as separate ports
as they require additional dependencies. They are available as:

py312-gdbm       databases/py-gdbm@py312
py312-sqlite3    databases/py-sqlite3@py312
py312-tkinter    x11-toolkits/py-tkinter@py312
=====
Message from py312-urllib3-2.8.0,1:

--
Since version 1.25 HTTPS connections are now verified by default which is done
via "cert_reqs = 'CERT_REQUIRED'".  While certificate verification can be
disabled via "cert_reqs = 'CERT_NONE'", it's highly recommended to leave it on.

Various consumers of net/py-urllib3 already have implemented routines that
either explicitly enable or disable HTTPS certificate verification (e.g. via
configuration settings, CLI arguments, etc.).

Yet it may happen that there are still some consumers which don't explicitly
enable/disable certificate verification for HTTPS connections which could then
lead to errors (as is often the case with self-signed certificates).

In case of an error one should try first to temporarily disable certificate
verification of the problematic urllib3 consumer to see if that approach will
remedy the issue.
===>   py312-elasticsearch-curator-5.8.4_2 depends on package: py312-boto3>=1.7.24 - found
===>   Returning to build of py312-elasticsearch-curator-5.8.4_2
===>   py312-elasticsearch-curator-5.8.4_2 depends on package: py312-certifi>=2018.10.15 - not found
===>   Installing existing package /packages/All/py312-certifi-2026.7.22.pkg
[144arm64-default-job-08] Installing py312-certifi-2026.7.22...
[144arm64-default-job-08] Extracting py312-certifi-2026.7.22: .......... done
===>   py312-elasticsearch-curator-5.8.4_2 depends on package: py312-certifi>=2018.10.15 - found
===>   Returning to build of py312-elasticsearch-curator-5.8.4_2
===>   py312-elasticsearch-curator-5.8.4_2 depends on package: py312-click7>=7.1.2 - not found
===>   Installing existing package /packages/All/py312-click7-7.1.2_1.pkg
[144arm64-default-job-08] Installing py312-click7-7.1.2_1...
[144arm64-default-job-08] Extracting py312-click7-7.1.2_1: .......... done
===>   py312-elasticsearch-curator-5.8.4_2 depends on package: py312-click7>=7.1.2 - found
===>   Returning to build of py312-elasticsearch-curator-5.8.4_2
===>   py312-elasticsearch-curator-5.8.4_2 depends on package: py312-elasticsearch>=7.15.1 - not found
===>   Installing existing package /packages/All/py312-elasticsearch-9.5.1.pkg
[144arm64-default-job-08] Installing py312-elasticsearch-9.5.1...
[144arm64-default-job-08] `-- Installing py312-anyio-4.15.1...
[144arm64-default-job-08] |   `-- Installing py312-idna-3.20...
[144arm64-default-job-08] |   `-- Extracting py312-idna-3.20: .......... done
[144arm64-default-job-08] |   `-- Installing py312-truststore-0.10.4_1...
[144arm64-default-job-08] |   `-- Extracting py312-truststore-0.10.4_1: .......... done
[144arm64-default-job-08] |   `-- Installing py312-typing-extensions-4.16.0...
[144arm64-default-job-08] |   `-- Extracting py312-typing-extensions-4.16.0: .......... done
[144arm64-default-job-08] `-- Extracting py312-anyio-4.15.1: .......... done
[144arm64-default-job-08] `-- Installing py312-elastic-transport-9.4.2...
[144arm64-default-job-08] |   `-- Installing py312-sniffio-1.3.1...
[144arm64-default-job-08] |   `-- Extracting py312-sniffio-1.3.1: .......... done
[144arm64-default-job-08] `-- Extracting py312-elastic-transport-9.4.2: .......... done
[144arm64-default-job-08] `-- Installing py312-requests-2.34.2...
[144arm64-default-job-08] |   `-- Installing py312-charset-normalizer-3.5.1...
[144arm64-default-job-08] |   `-- Extracting py312-charset-normalizer-3.5.1: .......... done
[144arm64-default-job-08] `-- Extracting py312-requests-2.34.2: .......... done
[144arm64-default-job-08] Extracting py312-elasticsearch-9.5.1: .......... done
===>   py312-elasticsearch-curator-5.8.4_2 depends on package: py312-elasticsearch>=7.15.1 - found
===>   Returning to build of py312-elasticsearch-curator-5.8.4_2
===>   py312-elasticsearch-curator-5.8.4_2 depends on package: py312-requests-aws4auth>=0.9 - not found
===>   Installing existing package /packages/All/py312-requests-aws4auth-1.3.2.pkg
[144arm64-default-job-08] Installing py312-requests-aws4auth-1.3.2...
[144arm64-default-job-08] Extracting py312-requests-aws4auth-1.3.2: .......... done
===>   py312-elasticsearch-curator-5.8.4_2 depends on package: py312-requests-aws4auth>=0.9 - found
===>   Returning to build of py312-elasticsearch-curator-5.8.4_2
===>   py312-elasticsearch-curator-5.8.4_2 depends on package: py312-six>=1.11.0 - found
===>   py312-elasticsearch-curator-5.8.4_2 depends on package: py312-urllib3>=1.26.4 - found
===>   py312-elasticsearch-curator-5.8.4_2 depends on package: py312-voluptuous>=0.9.3 - not found
===>   Installing existing package /packages/All/py312-voluptuous-0.16.0.pkg
[144arm64-default-job-08] Installing py312-voluptuous-0.16.0...
[144arm64-default-job-08] Extracting py312-voluptuous-0.16.0: .......... done
===>   py312-elasticsearch-curator-5.8.4_2 depends on package: py312-voluptuous>=0.9.3 - found
===>   Returning to build of py312-elasticsearch-curator-5.8.4_2
===>   py312-elasticsearch-curator-5.8.4_2 depends on package: py312-pyyaml>=3.10 - not found
===>   Installing existing package /packages/All/py312-pyyaml-6.0.3_1.pkg
[144arm64-default-job-08] Installing py312-pyyaml-6.0.3_1...
[144arm64-default-job-08] `-- Installing libyaml-0.2.5...
[144arm64-default-job-08] `-- Extracting libyaml-0.2.5: ......... done
[144arm64-default-job-08] Extracting py312-pyyaml-6.0.3_1: .......... done
===>   py312-elasticsearch-curator-5.8.4_2 depends on package: py312-pyyaml>=3.10 - found
===>   Returning to build of py312-elasticsearch-curator-5.8.4_2
===>   py312-elasticsearch-curator-5.8.4_2 depends on file: /usr/local/bin/python3.12 - found
===>   py312-elasticsearch-curator-5.8.4_2 depends on package: py312-setuptools>=63.1.0 - not found
===>   Installing existing package /packages/All/py312-setuptools-63.1.0_3.pkg
[144arm64-default-job-08] Installing py312-setuptools-63.1.0_3...
[144arm64-default-job-08] Extracting py312-setuptools-63.1.0_3: .......... done
===>   py312-elasticsearch-curator-5.8.4_2 depends on package: py312-setuptools>=63.1.0 - found
===>   Returning to build of py312-elasticsearch-curator-5.8.4_2
===>   py312-elasticsearch-curator-5.8.4_2 depends on file: /usr/local/bin/python3.12 - found
===========================================================================
=======================<phase: lib-depends    >============================
===== env: USE_PACKAGE_DEPENDS_ONLY=1 USER=root UID=0 GID=0
===========================================================================
=======================<phase: configure      >============================
===== env: NO_DEPENDS=yes USER=root UID=0 GID=0
===>  Configuring for py312-elasticsearch-curator-5.8.4_2
/usr/local/lib/python3.12/site-packages/setuptools/installer.py:27: SetuptoolsDeprecationWarning: setuptools.installer is deprecated. Requirements should be satisfied by a PEP 517 installer.
  warnings.warn(
WARNING: The wheel package is not available.
/usr/local/bin/python3.12: No module named pip
Traceback (most recent call last):
  File "setup.py", line 39, in <module>
    from cx_Freeze import setup, Executable
ModuleNotFoundError: No module named 'cx_Freeze'

During handling of the above exception, another exception occurred:

Traceback (most recent call last):
  File "/usr/local/lib/python3.12/site-packages/setuptools/installer.py", line 82, in fetch_build_egg
    subprocess.check_call(cmd)
  File "/usr/local/lib/python3.12/subprocess.py", line 413, in check_call
    raise CalledProcessError(retcode, cmd)
subprocess.CalledProcessError: Command '['/usr/local/bin/python3.12', '-m', 'pip', '--disable-pip-version-check', 'wheel', '--no-deps', '-w', '/tmp/tmp17b6vox2', '--quiet', 'elasticsearch<8.0.0,>=7.12.0']' returned non-zero exit status 1.

The above exception was the direct cause of the following exception:

Traceback (most recent call last):
  File "<string>", line 1, in <module>
  File "setup.py", line 144, in <module>
    setup(
  File "/usr/local/lib/python3.12/site-packages/setuptools/__init__.py", line 86, in setup
    _install_setup_requires(attrs)
  File "/usr/local/lib/python3.12/site-packages/setuptools/__init__.py", line 80, in _install_setup_requires
    dist.fetch_build_eggs(dist.setup_requires)
  File "/usr/local/lib/python3.12/site-packages/setuptools/dist.py", line 875, in fetch_build_eggs
    resolved_dists = pkg_resources.working_set.resolve(
                     ^^^^^^^^^^^^^^^^^^^^^^^^^^^^^^^^^^
  File "/usr/local/lib/python3.12/site-packages/pkg_resources/__init__.py", line 789, in resolve
    dist = best[req.key] = env.best_match(
                           ^^^^^^^^^^^^^^^
  File "/usr/local/lib/python3.12/site-packages/pkg_resources/__init__.py", line 1075, in best_match
    return self.obtain(req, installer)
           ^^^^^^^^^^^^^^^^^^^^^^^^^^^
  File "/usr/local/lib/python3.12/site-packages/pkg_resources/__init__.py", line 1087, in obtain
    return installer(requirement)
           ^^^^^^^^^^^^^^^^^^^^^^
  File "/usr/local/lib/python3.12/site-packages/setuptools/dist.py", line 945, in fetch_build_egg
    return fetch_build_egg(self, req)
           ^^^^^^^^^^^^^^^^^^^^^^^^^^
  File "/usr/local/lib/python3.12/site-packages/setuptools/installer.py", line 84, in fetch_build_egg
    raise DistutilsError(str(e)) from e
distutils.errors.DistutilsError: Command '['/usr/local/bin/python3.12', '-m', 'pip', '--disable-pip-version-check', 'wheel', '--no-deps', '-w', '/tmp/tmp17b6vox2', '--quiet', 'elasticsearch<8.0.0,>=7.12.0']' returned non-zero exit status 1.
*** Error code 1

Stop.
make: stopped making "configure" in /usr/ports/textproc/py-elasticsearch-curator

